{"text_format":"1","workbook":"xlsx","n_sheets":10,"sheets":["OPERACIONES PREVIAS","REGISTRO","CERTIFICADO","CORRECCIÓN EQUIPOS AUX","LISTADO DE PATRONES","PRESUPUESTO DE U","TABLA DE CONVERSIÓN","CURVAS DE AJUSTE","CMC","LISTAS"],"not_rendered":{"charts":17,"images":12,"macros":1,"external_links":0,"defined_names":52,"comments":1,"pivot_tables":0},"unopened":[],"bounds":{"document_bytes":16777216,"sheet_cells":100000,"rows_first":2000,"rows_last":500,"rows_between":2000,"halvings":0,"cell_chars":16384,"cell_head_chars":4096},"cells_cut":0,"cells_raw":0,"read":"whole","date_system":"1900"}

{"sheet":"OPERACIONES PREVIAS","index":0,"n_rows":89,"n_cols":12,"rows_kept":89,"cut":false,"hidden":false,"merged":[[1,2,1,6],[1,8,1,9],[1,10,1,11],[2,2,2,6],[2,8,2,9],[2,10,2,11],[4,3,4,5],[5,3,5,5],[6,3,6,5],[7,3,7,5],[10,3,10,4],[10,10,10,11],[11,3,11,4],[11,10,11,11],[13,3,13,4],[13,8,13,9],[14,3,14,4],[14,8,14,9],[17,3,17,10],[27,1,27,5],[27,8,27,11],[62,1,62,11],[68,1,68,11],[78,1,78,2],[88,3,88,5],[88,7,88,9],[28,6,30,6],[31,6,33,6],[34,6,36,6],[37,6,39,6],[40,6,42,6],[43,6,45,6],[46,6,48,6],[49,6,51,6],[52,6,54,6],[55,6,57,6],[58,6,60,6],[28,7,30,7],[31,7,33,7],[34,7,36,7],[37,7,39,7],[40,7,42,7],[43,7,45,7],[46,7,48,7],[49,7,51,7],[52,7,54,7],[55,7,57,7],[58,7,60,7],[70,8,71,8],[70,9,71,9],[70,10,71,10],[80,1,84,11],[34,8,36,11],[31,8,33,11],[58,1,60,5],[58,8,60,11],[31,1,33,5],[34,1,36,5],[37,1,39,5],[28,1,30,5],[37,8,39,11],[28,8,30,11],[20,1,24,11],[55,8,57,11],[40,1,42,5],[40,8,42,11],[55,1,57,5],[52,8,54,11],[49,8,51,11],[49,1,51,5],[52,1,54,5],[76,7,77,10],[70,2,71,3],[70,4,71,5],[70,6,71,7],[46,8,48,11],[46,1,48,5],[43,1,45,5],[43,8,45,11]]}
[]
[null,"Solicitante:","SCHLUMBERGER SURENCO S A",null,null,null,null,null,"Número de certificado:",null,"DID-159-3123"]
[null,"Dirección:","KILOMETRO 1.5 VIA SIBERIA COTA PARQUE INDUSTRIAL POTRERO CHICO, COTA",null,null,null,null,null,"Número de ingreso:",null,18200]
[null,null,null," ",null,null,null,null,{"$f":"\"Intervalo de medida \"&\"(\"&D9&\"):\"","v":"Intervalo de medida (psi):"},null,0,1500]
[null,"Instrumento:",null,"MANÓMETRO",null,null,"ANALÓGICO",null,{"$f":"\"Intervalo de calibration \"&\"(\"&D9&\"):\"","v":"Intervalo de calibration (psi):"},null,0,1500]
[null,"Fabricante:",null,"STEWARTS-USA",null,null,null,null,"División de escala:",null,25,{"$f":"D9","v":"psi"}]
[null,"Modelo:",null,"NO IDENTIFICABLE",null,null,null,null,"Resolución:",null,12.5,{"$f":"D9","v":"psi"}]
[null,"Serie:",null,"CR-1419",null,null,null,null,"Clase:",null,1.6,"DEL RANGO"]
{"$rows_left_out":82}
{"sheet":"REGISTRO","index":1,"n_rows":171,"n_cols":34,"rows_kept":171,"cut":false,"hidden":false,"merged":[[1,13,1,17],[2,1,2,10],[2,13,2,17],[3,1,3,3],[3,4,3,10],[5,1,5,4],[6,1,6,2],[6,3,6,4],[6,6,6,10],[7,1,7,2],[7,3,7,4],[7,6,7,7],[8,1,8,2],[8,3,8,4],[8,6,8,7],[8,21,8,22],[9,1,9,2],[9,3,9,4],[9,6,9,7],[9,21,9,22],[10,1,10,2],[10,3,10,4],[10,6,10,7],[11,3,11,4],[11,6,11,7],[12,3,12,4],[13,1,13,2],[13,3,13,4],[14,1,14,2],[14,3,14,4],[14,28,14,29],[14,31,14,32],[15,3,15,4],[17,21,17,22],[18,21,18,22],[19,21,19,22],[21,1,21,10],[22,1,22,2],[24,2,24,10],[24,20,24,21],[25,20,25,21],[29,29,29,33],[30,29,30,30],[31,29,31,30],[32,29,32,30],[33,29,33,30],[34,29,34,30],[36,29,36,30],[36,31,36,32],[40,2,40,10],[53,2,53,10],[70,1,70,6],[75,1,75,10],[100,2,100,9],[103,2,103,3],[104,2,104,3],[105,2,105,3],[106,2,106,3],[108,1,108,10],[120,3,120,8],[128,14,128,23],[132,1,132,5],[132,6,132,10],[140,13,140,20],[160,3,160,5],[160,7,160,9],[168,0,171,0],[24,1,27,1],[28,1,33,1],[34,1,39,1],[41,1,46,1],[47,1,52,1],[54,1,59,1],[60,1,65,1],[109,1,111,1],[133,1,135,1],[109,2,110,2],[133,2,135,2],[18,3,19,3],[109,3,110,3],[121,3,123,3],[133,3,135,3],[18,4,19,4],[101,4,102,4],[109,4,110,4],[121,4,123,4],[133,4,135,4],[109,5,110,5],[121,5,122,5],[133,5,135,5],[109,6,110,6],[121,6,122,6],[133,6,135,6],[109,7,110,7],[121,7,122,7],[133,7,135,7],[25,8,26,8],[103,8,106,8],[109,8,110,8],[121,8,122,8],[133,8,135,8],[25,9,26,9],[103,9,106,9],[109,9,110,9],[122,9,124,9],[133,9,135,9],[25,10,26,10],[109,10,110,10],[122,10,124,10],[133,10,135,10],[140,12,142,12],[3,13,4,13],[129,13,131,13],[142,13,143,13],[3,14,4,14],[129,14,131,14],[142,14,143,14],[3,15,4,15],[24,15,26,15],[129,15,131,15],[142,15,143,15],[3,16,4,16],[24,16,26,16],[129,16,131,16],[142,16,143,16],[3,17,4,17],[24,17,26,17],[129,17,131,17],[142,17,143,17],[24,18,26,18],[129,18,131,18],[142,18,143,18],[129,19,131,19],[142,19,143,19],[129,20,131,20],[142,20,143,20],[129,21,131,21],[129,22,131,22],[129,23,131,23],[144,23,145,23],[129,24,131,24],[144,24,145,24],[129,25,131,25],[129,26,131,26],[1,27,3,27],[129,27,131,27],[1,28,3,28],[101,2,102,3],[144,21,145,22],[12,6,13,7],[24,13,26,14],[12,9,13,10],[25,2,26,3],[25,4,26,5],[25,6,26,7],[145,2,146,9],[15,6,18,10],[101,5,102,6]]}
[null,12345]
[null,null,null,null,null,null,null,null,null,null,null,null,null,"DATOS DE CALIBRACIÓN DEL PATRÓN",null,null,null,null,null,"Sí",null,"Tipo de fluido","Densidad","U",null,null,null,"Resolución Patrón","Resolución IBC",null,0,0]
[null,"CONDICIONES AMBIENTALES",null,null,null,null,null,null,null,null,null,null,null,{"$f":"VLOOKUP(D10,X26:Z35,3,0)","v":"DATOS_3000"},null,null,null,null,null,"NO",null,"Aceite",863.3,86.3,"kg/m3",null,null,null,null,null,1,"0.0"]
[null,"CALIBRACIÓN EN:",null,null,"INSTALACIONES PERMANENTES",null,null,null,null,null,null,null,null,"Lectura \nPatrón","Lectura \nIBC","Error de \nMedición","U\nExpandida","Deriva",null,null,null,"Alcohol",812.8,81.28,"kg/m3",null,null,null,null,null,2,"0.00"]
[null,null,null,null,null,null,null,null,null,null,null,null,null,null,null,null,null,null,null,null,null,"Agua ",998.193,0.01,"kg/m3",null,null,"psi","psi",null,3,"0.000"]
[null,"DATOS DEL PATRÓN",null,null,null,null,null,null,null,null,null,null,null,"psi","psi","psi","psi","psi",null,null,null,"Aire",0.8876,0.012,"kg/m3",null,"Resolución",{"$f":"$D$17","v":0},{"$f":"'OPERACIONES PREVIAS'!$K$7","v":12.5},null,4,"0.0000"]
[null,"Patrón usado:",null,{"$f":"IF(D10<0,\"VACÚOMETRO DIGITAL\",\"MANÓMETRO DIGITAL\")","v":"MANÓMETRO DIGITAL"},null,null,"CORRECCIÓN POR DIFERENCIA DE ALTURAS",null,null,null,null,null,null,{"$f":"INDIRECT(N3)","v":296.25},296.2,-0.0500000000000114,0.084,0.0300000000000114,null,null,null,null,null,null,null,null,"Decimales",{"$f":"IF((LEN(AB6)-LEN(INT(AB6))-1)<0,0,(LEN(AB6)-LEN(INT(AB6))-1))","v":0},{"$f":"IF((LEN(AC6)-LEN(INT(AC6))-1)<0,0,(LEN(AC6)-LEN(INT(AC6))-1))","v":1},null,5,"0.00000"]
[null,"Marca:",null,{"$f":"VLOOKUP($D$10,LISTADO_PATRONES,2,0)","v":"ADDITEL"},null,null,"Magnitud",null,"Valor","U","Unidad",null,null,592.75,592.6,-0.149999999999977,0.086,0.109999999999977,null,null,null,"Incertidumbre de la regla patrón",null,null,null,null,"Formato",{"$f":"VLOOKUP(AB7,AE2:AF11,2,FALSE)","v":0},{"$f":"VLOOKUP(AC7,AE2:AF11,2,FALSE)","v":"0.0"},null,6,"0.000000"]
{"$rows_left_out":164}
{"sheet":"CERTIFICADO","index":2,"n_rows":58,"n_cols":37,"rows_kept":58,"cut":false,"hidden":false,"merged":[[7,0,7,6],[7,8,7,16],[7,18,7,26],[7,28,7,36],[8,0,8,6],[8,8,8,16],[8,18,8,26],[8,28,8,36],[9,0,9,6],[9,8,9,16],[9,18,9,26],[9,28,9,36],[12,5,12,6],[12,15,12,16],[12,24,12,26],[12,34,12,36],[14,3,14,6],[15,18,15,20],[15,21,15,23],[15,24,15,26],[18,3,18,6],[20,3,20,6],[22,3,22,6],[22,8,22,16],[23,10,23,12],[23,14,23,16],[24,3,24,6],[24,10,24,12],[24,14,24,16],[25,10,25,12],[25,13,25,14],[25,15,25,16],[26,10,26,12],[27,8,27,16],[28,10,28,12],[28,14,28,16],[29,10,29,12],[29,14,29,16],[30,10,30,12],[30,15,30,16],[31,10,31,12],[32,3,32,6],[32,8,32,16],[33,10,33,12],[33,14,33,16],[34,3,34,6],[34,10,34,12],[34,14,34,16],[35,10,35,12],[36,10,36,12],[37,8,37,16],[38,10,38,12],[38,14,38,16],[39,10,39,12],[39,14,39,16],[40,0,40,1],[40,10,40,12],[41,10,41,12],[42,8,42,16],[43,8,43,16],[44,1,44,4],[44,8,44,9],[44,10,44,15],[45,2,45,3],[45,8,45,9],[45,10,45,12],[45,14,45,16],[46,8,46,9],[46,10,46,12],[46,14,46,16],[47,10,47,12],[49,28,49,29],[49,30,49,34],[50,8,50,16],[53,28,53,36],[56,0,56,6],[56,8,56,16],[56,18,56,26],[56,28,56,36],[57,0,57,6],[57,8,57,16],[57,18,57,26],[57,28,57,36],[28,19,29,19],[38,19,39,19],[28,20,29,20],[38,20,39,20],[28,23,29,23],[38,23,39,23],[28,21,29,22],[35,15,36,16],[28,24,29,25],[47,0,54,6],[50,28,52,36],[37,28,48,36],[26,3,27,6],[28,3,29,6],[38,24,39,25],[22,18,24,26],[15,8,19,16],[126,25,127,26],[53,8,54,16],[38,21,39,22]]}
[]
[]
[]
[]
[]
[]
[]
["CERTIFICADO DE CALIBRACIÓN",null,null,null,null,null,null,null,{"$f":"$A$8","v":"CERTIFICADO DE CALIBRACIÓN"},null,null,null,null,null,null,null,null,null,{"$f":"$A$8","v":"CERTIFICADO DE CALIBRACIÓN"},null,null,null,null,null,null,null,null,null,{"$f":"$A$8","v":"CERTIFICADO DE CALIBRACIÓN"}]
{"$rows_left_out":51}
{"sheet":"CORRECCIÓN EQUIPOS AUX","index":3,"n_rows":97,"n_cols":25,"rows_kept":97,"cut":false,"hidden":true,"merged":[[1,0,1,1],[1,2,1,4],[1,6,1,8],[2,0,2,1],[2,2,2,4],[2,6,2,8],[3,0,3,1],[3,2,3,4],[4,0,4,1],[4,2,4,4],[6,0,6,7],[7,0,7,7],[12,0,12,5],[15,0,15,5],[20,0,20,1],[20,2,20,4],[20,6,20,8],[20,10,20,11],[20,12,20,14],[20,16,20,18],[21,0,21,1],[21,2,21,4],[21,6,21,8],[21,10,21,11],[21,12,21,14],[21,16,21,18],[22,0,22,1],[22,2,22,4],[22,10,22,11],[22,12,22,14],[23,0,23,1],[23,2,23,4],[23,10,23,11],[23,12,23,14],[25,0,25,7],[26,0,26,7],[26,16,26,22],[31,0,31,5],[34,0,34,5],[54,0,54,1],[54,2,54,4],[54,6,54,8],[55,0,55,1],[55,2,55,4],[55,6,55,8],[56,0,56,1],[56,2,56,4],[57,0,57,1],[57,2,57,4],[59,6,59,11],[59,12,59,14],[73,11,73,12],[92,1,92,13],[93,1,93,2],[95,1,95,13],[96,1,96,2],[3,5,4,5],[22,5,23,5],[56,5,57,5],[60,6,61,6],[60,7,61,7],[60,8,61,8],[60,9,61,9],[60,10,61,10],[60,11,61,11],[60,12,61,12],[60,13,61,13],[60,14,61,14],[22,15,23,15],[56,6,57,8],[3,6,4,8],[22,6,23,8],[22,16,23,18]]}
[]
["Instrumento:",null,"TERMOHIGRÓMETRO DIGITAL",null,null,"Marca:","T&D CORPORATION"]
["Serie:",null,"F80629AA",null,null,"Modelo:","TR-73U"]
["Certificado No:",null,"C4502-20 ",null,null,"Intervalo de medición:","18°C a 28 °C / 30 %HR a 70%HR"]
["Fecha de calibración:",null,"2020-01-05"]
[]
["INSTALACIONES PERMANENTES"]
["Correcciones condiciones ambientales"]
{"$rows_left_out":90}
{"sheet":"LISTADO DE PATRONES","index":4,"n_rows":13,"n_cols":12,"rows_kept":13,"cut":false,"hidden":true,"merged":[[0,0,0,11],[1,0,2,0],[1,1,2,1],[1,2,2,2],[1,3,2,3],[1,4,2,4],[1,5,2,5],[1,6,2,6],[1,7,2,7],[1,8,2,8],[1,9,2,9],[1,10,2,10],[1,11,2,11]]}
["DATOS DE LOS PATRONES DE TRABAJO USADOS EN LA CALIBRACIÓN"]
["RANGO EN \npsi","MARCA","MODELO","SERIE","RANGO","NÚMERO DE CERTIFICADO","FECHA DE CALIBRACIÓN","PRÓXIMA CALIBRACIÓN","PRECISIÓN","TOLERANCIA","DERIVA","RESOLUCIÓN"]
[]
[15,"FLUKE","2700G-BG100K","CS-MP-013 / 3329023","0 a 100 kPa \n(0 a 15 psi)","LPR200098a","2020-01-24","2022-01-24",0.0002,{"$f":"(I4*A4)","v":0.003},0.003,0.0001]
[50,"ADDITEL","ADT672","CS-MP-008 / 27312090063","0 a 345 kPa \n(0 a 50 psi)","LPR200099","2020-01-24","2022-01-24",0.00025,0.0125,0.0125,0.001]
[300,"AMETEK","IPI300CBXXINDG","CS-MP-005 / 9615005","0 a 2068 kPa \n(0 a 300 psi)","LRP200101","2020-01-23","2022-01-23",0.0005,0.15,0.15,0.001]
[1000,"ADDITEL","ADT672","CS-MP-011 / 27312330044","0 a 6895 kPa \n(0 a 1000 psi)","LPR200103","2020-01-24","2022-01-24",0.00025,0.25,0.25,0.001]
[3000,"ADDITEL","ADT672","CS-MP-010 / 27312320013"," 0 a 20648 kPa \n(300 a 3000 psi)","LPR181275a","2018-10-12","2020-10-12",0.00025,0.75,0.75,0.001]
{"$rows_left_out":6}
{"sheet":"PRESUPUESTO DE U","index":5,"n_rows":95,"n_cols":19,"rows_kept":95,"cut":false,"hidden":true,"merged":[[0,1,0,14],[7,3,7,12],[30,1,30,3],[32,6,32,11],[33,6,33,11],[34,6,34,11],[35,6,35,11],[38,6,38,11],[39,6,39,11],[40,6,40,11],[43,6,43,11],[44,6,44,11],[45,6,45,11],[48,6,48,11],[49,6,49,11],[50,6,50,11],[51,6,51,11],[52,6,52,11],[53,6,53,11],[54,6,54,11],[55,6,55,11],[56,6,56,11],[69,6,69,7],[102,1,102,14],[0,0,102,0],[25,1,28,1],[70,1,73,1],[74,1,76,1],[77,1,82,1],[83,1,86,1],[87,1,89,1],[90,1,91,1],[92,1,93,1],[81,2,82,2],[67,3,69,3],[81,3,82,3],[36,4,37,4],[41,4,42,4],[46,4,47,4],[81,4,82,4],[36,5,37,5],[41,5,42,5],[46,5,47,5],[81,5,82,5],[83,5,86,5],[87,5,89,5],[90,5,91,5],[92,5,93,5],[94,5,95,5],[81,6,82,6],[83,6,86,6],[92,6,93,6],[94,6,95,6],[81,7,82,7],[67,8,69,8],[81,8,82,8],[67,9,69,9],[81,9,82,9],[67,10,69,10],[81,10,82,10],[81,11,82,11],[81,12,82,12],[4,13,5,13],[6,13,7,13],[67,13,69,13],[81,13,82,13],[4,14,5,14],[6,14,7,14],[67,14,69,14],[77,14,82,14],[67,1,69,2],[67,11,69,12],[46,6,47,11],[41,6,42,11],[36,6,37,11],[87,2,89,4],[90,2,91,4],[92,2,93,4],[57,4,58,11],[67,4,68,7],[94,1,95,4],[83,2,86,4],[1,3,3,12],[4,3,6,12],[1,1,7,2],[1,13,3,14]]}
[]
[null,null,null,"REQUISITOS DE GESTIÓN TÉCNICA",null,null,null,null,null,null,null,null,null,"FLAB-07-P1"]
[]
[]
[null,null,null,"CERTIFICADO DE CALIBRACIÓN DE MANÓMETROS, VACUÓMETROS Y MANOVACUÓMETROS",null,null,null,null,null,null,null,null,null,"Revisión:",3]
[]
[null,null,null,null,null,null,null,null,null,null,null,null,null,"Versión:",3]
[null,null,null,"PRESUPUESTO DE U"]
{"$rows_left_out":88}
{"sheet":"TABLA DE CONVERSIÓN","index":6,"n_rows":14,"n_cols":13,"rows_kept":14,"cut":false,"hidden":true,"merged":[[0,0,0,12]]}
["TABLAS DE CONVERSIÓN PARA UNIDADES DE PRESIÓN - NTC 3669:1995"]
["UNIDADES","Pa","kPa","MPa","bar","mbar","psi","kg/cm²","kgf/m2","inHg","inH2o","mmHg","mmH2o"]
["Pa",1,0.001,1e-6,1e-5,0.01,0.0001450377,1.019716e-5,0.1019716,0.0002952999,248.84,0.007500617]
["kPa",1000,1,0.001,0.01,10,0.1450377,0.01019716,101.9716,0.2952999,0.24884,7.500617]
["MPa",1000000,1000,1,10,10000,145.0377,10.19716,101971.6,295.2999,null,7500.617]
["bar",100000,100,0.1,1,1000,14.50377,1.019716,10197.16,29.52999,null,750.0617]
["mbar",100,0.1,0.0001,0.001,1,0.01450377,0.001019716,10.19716,0.02952999,null,0.7500617]
["psi",6894.76,6.89476,0.006894757,0.0689476,68.94757,1,0.070307,703.0696,2.036021,0.0360912,51.71493]
{"$rows_left_out":7}
{"sheet":"CURVAS DE AJUSTE","index":7,"n_rows":89,"n_cols":120,"rows_kept":89,"cut":false,"hidden":true,"merged":[[4,2,4,7],[4,8,4,10],[4,14,4,19],[4,20,4,22],[4,26,4,31],[4,32,4,34],[4,38,4,43],[4,44,4,46],[4,50,4,55],[4,56,4,58],[4,62,4,67],[4,68,4,70],[4,74,4,79],[4,80,4,82],[4,86,4,91],[4,92,4,94],[4,98,4,103],[4,104,4,106],[4,110,4,115],[4,116,4,118],[18,7,18,8],[18,19,18,20],[18,31,18,32],[18,43,18,44],[18,55,18,56],[18,67,18,68],[18,79,18,80],[18,91,18,92],[18,103,18,104],[18,115,18,116],[20,104,20,105],[20,115,20,116],[21,19,21,20],[21,31,21,32],[21,43,21,44],[21,55,21,56],[21,68,21,69],[21,80,21,81],[21,92,21,93],[25,5,25,6],[5,2,6,2],[5,3,6,3],[34,3,35,3],[5,4,6,4],[34,4,35,4],[5,5,6,5],[34,5,35,5],[5,6,6,6],[5,8,6,8],[5,9,6,9],[5,10,6,10],[5,14,6,14],[5,15,6,15],[33,15,34,15],[5,16,6,16],[33,16,34,16],[5,17,6,17],[33,17,34,17],[5,18,6,18],[5,20,6,20],[5,21,6,21],[5,22,6,22],[47,23,48,23],[5,26,6,26],[5,27,6,27],[32,27,33,27],[5,28,6,28],[32,28,33,28],[5,29,6,29],[32,29,33,29],[5,30,6,30],[5,32,6,32],[5,33,6,33],[5,34,6,34],[5,38,6,38],[5,39,6,39],[32,39,33,39],[5,40,6,40],[32,40,33,40],[5,41,6,41],[32,41,33,41],[5,42,6,42],[5,44,6,44],[5,45,6,45],[5,46,6,46],[5,50,6,50],[5,51,6,51],[32,51,33,51],[5,52,6,52],[32,52,33,52],[5,53,6,53],[32,53,33,53],[5,54,6,54],[5,56,6,56],[5,57,6,57],[20,57,22,57],[5,58,6,58],[5,62,6,62],[5,63,6,63],[32,63,33,63],[5,64,6,64],[32,64,33,64],[5,65,6,65],[32,65,33,65],[5,66,6,66],[5,68,6,68],[5,69,6,69],[5,70,6,70],[5,74,6,74],[5,75,6,75],[32,75,33,75],[5,76,6,76],[32,76,33,76],[5,77,6,77],[32,77,33,77],[5,78,6,78],[5,80,6,80],[5,81,6,81],[5,82,6,82],[5,86,6,86],[5,87,6,87],[32,87,33,87],[5,88,6,88],[32,88,33,88],[5,89,6,89],[32,89,33,89],[5,90,6,90],[5,92,6,92],[5,93,6,93],[5,94,6,94],[5,98,6,98],[5,99,6,99],[32,99,33,99],[5,100,6,100],[32,100,33,100],[5,101,6,101],[32,101,33,101],[5,102,6,102],[5,104,6,104],[5,105,6,105],[5,106,6,106],[5,110,6,110],[5,111,6,111],[32,111,33,111],[5,112,6,112],[32,112,33,112],[5,113,6,113],[32,113,33,113],[5,114,6,114],[5,116,6,116],[5,117,6,117],[5,118,6,118],[1,25,2,35],[1,37,2,47],[1,49,2,59],[1,61,2,71],[1,73,2,83],[1,85,2,95],[1,97,2,107],[1,109,2,119],[1,1,2,11],[1,13,2,23],[19,94,23,95]]}
[]
[null,"MANÓMETRO FLUKE DE 0 a 100 kPa (0 a 15 psi)",null,null,null,null,null,null,null,null,null,null,null,"MANÓMETRO ADDITEL DE 0 a 345 kPa (0 a 50 psi)",null,null,null,null,null,null,null,null,null,null,null,"MANÓMETRO AMETEK DE 0 a 2 068 kPa (0 a 300 psi)",null,null,null,null,null,null,null,null,null,null,null,"MANÓMETRO ADDITEL DE 0 a 6 895 kPa (0 a 1 000 psi)",null,null,null,null,null,null,null,null,null,null,null,"MANÓMETRO ADDITEL DE 0 a 20 648 kPa (0 a 3 000 psi)",null,null,null,null,null,null,null,null,null,null,null,"MANÓMETRO ADDITEL DE 0 a 34 474 kPa (0 a 5 000 psi)",null,null,null,null,null,null,null,null,null,null,null,"MANÓMETRO FLUKE DE 0 a 68948 kPa (0 a 10000 psi)",null,null,null,null,null,null,null,null,null,null,null,"MANÓMETRO ADDITEL DE 0 a 24 8211 kPa (0 a 36 000 psi)",null,null,null,null,null,null,null,null,null,null,null,"VACUÓMETRO FLUKE  DE 0 a -100 kPa (0 a -15 psi)",null,null,null,null,null,null,null,null,null,null,null,"VACUÓMETRO AMETEK DE 0 a -100 kPa (0 a -30 inHg)"]
[]
[null,null,null,null,null,null,null,null,null,null,null,"OK",null,null,null,null,null,null,null,null,null,null,null,"OK",null,null,null,null,null,null,null,null,null,null,null,"OK",null,null,null,null,null,null,null,null,null,null,null,"OK",null,null,null,null,null,null,null,null,null,null,null,"OK",null,null,null,null,null,null,null,null,null,null,null,"OK",null,null,null,null,null,null,null,null,null,null,null,"OK",null,null,null,null,null,null,null,null,null,null,null,"OK",null,null,null,null,null,null,null,null,null,null,null,"OK",null,null,null,null,null,null,null,null,null,null,null,"OK"]
[null,null,"Resultados de la calibración",null,null,null,null,null,"Curva de ajuste",null,null,null,null,null,"Resultados de la calibración",null,null,null,null,null,"Curva de ajuste",null,null,null,null,null,"Resultados de la calibración",null,null,null,null,null,"Curva de ajuste",null,null,null,null,null,"Resultados de la calibración",null,null,null,null,null,"Curva de ajuste",null,null,null,null,null,"Resultados de la calibración",null,null,null,null,null,"Curva de ajuste",null,null,null,null,null,"Resultados de la calibración",null,null,null,null,null,"Curva de ajuste",null,null,null,null,null,"Resultados de la calibración",null,null,null,null,null,"Curva de ajuste",null,null,null,null,null,"Resultados de la calibración",null,null,null,null,null,"Curva de ajuste",null,null,null,null,null,"Resultados de la calibración",null,null,null,null,null,"Curva de ajuste",null,null,null,null,null,"Resultados de la calibración",null,null,null,null,null,"Curva de ajuste"]
[null,null,"Lectura \nPatrón","Lectura \nIBC","Error de \nmedición","U\nExpandida","Deriva","Error","Error \nestimado","Error \nresidual","u\nTotal",null,null,null,"Lectura \nPatrón","Lectura \nIBC","Error de \nmedición","U\nExpandida","Deriva","Error","Error \nestimado","Error \nresidual","u\nTotal",null,null,null,"Lectura \nPatrón","Lectura \nIBC","Error de \nmedición","U\nExpandida","Deriva","Error","Error \nestimado","Error \nresidual","u\nTotal",null,null,null,"Lectura \nPatrón","Lectura \nIBC","Error de \nmedición","U\nExpandida","Deriva","Error","Error \nestimado","Error \nresidual","u\nTotal",null,null,null,"Lectura \nPatrón","Lectura \nIBC","Error de \nmedición","U\nExpandida","Deriva","Error","Error \nestimado","Error \nresidual","U\nTotal",null,null,null,"Lectura \nPatrón","Lectura \nIBC","Error de \nmedición","U\nExpandida","Deriva","Error","Error \nestimado","Error \nresidual","U\nTotal",null,null,null,"Lectura \nPatrón","Lectura \nIBC","Error de \nmedición","U\nExpandida","Deriva","Error","Error \nestimado","Error \nresidual","U\nTotal",null,null,null,"Lectura \nPatrón","Lectura \nIBC","Error de \nmedición","U\nExpandida","Deriva","Error","Error \nestimado","Error \nresidual","U\nTotal",null,null,null,"Lectura \nPatrón","Lectura \nIBC","Error de \nmedición","U\nExpandida","Deriva","Error","Error \nestimado","Error \nresidual","U\nTotal",null,null,null,"Lectura \nPatrón","Lectura \nIBC","Error de \nmedición","U\nExpandida","Deriva","Error","Error \nestimado","Error \nresidual","U\nTotal"]
[null,null,null,null,null,null,null,"Anterior",null,null,null,null,null,null,null,null,null,null,null,"Anterior",null,null,null,null,null,null,null,null,null,null,null,"Anterior",null,null,null,null,null,null,null,null,null,null,null,"Anterior",null,null,null,null,null,null,null,null,null,null,null,"Anterior",null,null,null,null,null,null,null,null,null,null,null,"Anterior",null,null,null,null,null,null,null,null,null,null,null,"Anterior",null,null,null,null,null,null,null,null,null,null,null,"Anterior",null,null,null,null,null,null,null,null,null,null,null,"Anterior",null,null,null,null,null,null,null,null,null,null,null,"Anterior"]
[null,null,"psi","psi","psi","psi","psi","psi","psi","psi","psi",null,null,null,"psi","psi","psi","psi","psi","psi","psi","psi","psi",null,null,null,"psi","psi","psi","psi","psi","psi","psi","psi","psi",null,null,null,"psi","psi","psi","psi","psi","psi","psi","psi","psi",null,null,null,"psi","psi","psi","psi","psi","psi","psi","psi","psi",null,null,null,"psi","psi","psi","psi","psi","psi","psi","psi","psi",null,null,null,"psi","psi","psi","psi","psi","psi","psi","psi","psi",null,null,null,"psi","psi","psi","psi","psi","psi","psi","psi","psi",null,null,null,"psi","psi","psi","psi","psi","psi","psi","psi","psi",null,null,null,"inHg","inHg","inHg","inHg","inHg","inHg","inHg","inHg","inHg"]
{"$rows_left_out":82}
{"sheet":"CMC","index":8,"n_rows":7,"n_cols":2,"rows_kept":7,"cut":false,"hidden":true,"merged":[]}
["INTERVALO","CMC"]
["(-68,947 a 0 kPa)\n(-10 psi a 0 psi)","0,23 kPa\n0,034 (psi)"]
[">0 kPa a 344,738 kPa\n(>0 psi a 50 psi)","0,23 kPa\n0,033 (psi)"]
[">344,74 kPa a 2 068,43 kPa\n(>50 psi a 300 psi)","0,30 kPa\n0,44 (psi)"]
[">2 068,43 kPa a 20 684,27 kPa\n(>300 psi a 3 000 psi)","1,4 kPa\n0,21 (psi)"]
[">34 473,79 kPa a 68 947,57 kPa\n(>5 000 psi a 10 000 psi)","9,3 kPa\n1,4 (psi)"]
[">68 947,57 kPa a 248 211,26 kPa\n(>10 000 psi a 36 000 psi)","62 kPa\n8,9 (psi)"]

{"sheet":"LISTAS","index":9,"n_rows":37,"n_cols":16,"rows_kept":37,"cut":false,"hidden":false,"merged":[[22,0,22,3]]}
["ESPECIALISTA TÉCNICO","Nombre de firma"]
["ALEIDIMAR PIÑA","firma_juancarlos",1025]
["MICHAEL VALERO","firma_germica","Michael"]
[]
[]
[null,null,null,null,null,null,null,"FIRMA ACTUAL","CLAVE ACTUAL"]
["DIRECTOR TÉCNICO","Nombre de firma",null,null,null,null,"Especialista",{"$f":"VLOOKUP(REGISTRO!D161,LISTAS!A2:B4,2,0)","v":"firma_germica"},{"$f":"VLOOKUP(H7,B2:C4,2,0)","v":"Michael"}]
["JUAN CARLOS FANEITE FINOL","firma_juancarlos","DIRECTOR1",null,null,null,"Director",{"$f":"VLOOKUP(REGISTRO!D161,LISTAS!A8:B8,2,0)","v":{"$error":"#N/A"}},{"$f":"VLOOKUP(H8,B8:C11,2,0)","v":{"$error":"#N/A"}}]
{"$rows_left_out":29}