{"text_format":"1","workbook":"xlsx","n_sheets":10,"sheets":["OPERACIONES PREVIAS","REGISTRO","CERTIFICADO","CORRECCIÓN EQUIPOS AUX","LISTADO DE PATRONES","PRESUPUESTO DE U","TABLA DE CONVERSIÓN","CURVAS DE AJUSTE","CMC","LISTAS"],"not_rendered":{"charts":17,"images":12,"macros":1,"external_links":0,"defined_names":52,"comments":1,"pivot_tables":0},"unopened":[],"bounds":{"document_bytes":16777216,"sheet_cells":100000,"rows_first":2000,"rows_last":500,"rows_between":2000,"halvings":0,"cell_chars":16384,"cell_head_chars":4096},"cells_cut":0,"cells_raw":0,"read":"whole","date_system":"1900"}

{"sheet":"OPERACIONES PREVIAS","index":0,"n_rows":89,"n_cols":12,"rows_kept":89,"cut":false,"hidden":false,"merged":[[1,2,1,6],[1,8,1,9],[1,10,1,11],[2,2,2,6],[2,8,2,9],[2,10,2,11],[4,3,4,5],[5,3,5,5],[6,3,6,5],[7,3,7,5],[10,3,10,4],[10,10,10,11],[11,3,11,4],[11,10,11,11],[13,3,13,4],[13,8,13,9],[14,3,14,4],[14,8,14,9],[17,3,17,10],[27,1,27,5],[27,8,27,11],[62,1,62,11],[68,1,68,11],[78,1,78,2],[88,3,88,5],[88,7,88,9],[28,6,30,6],[31,6,33,6],[34,6,36,6],[37,6,39,6],[40,6,42,6],[43,6,45,6],[46,6,48,6],[49,6,51,6],[52,6,54,6],[55,6,57,6],[58,6,60,6],[28,7,30,7],[31,7,33,7],[34,7,36,7],[37,7,39,7],[40,7,42,7],[43,7,45,7],[46,7,48,7],[49,7,51,7],[52,7,54,7],[55,7,57,7],[58,7,60,7],[70,8,71,8],[70,9,71,9],[70,10,71,10],[80,1,84,11],[34,8,36,11],[31,8,33,11],[58,1,60,5],[58,8,60,11],[31,1,33,5],[34,1,36,5],[37,1,39,5],[28,1,30,5],[37,8,39,11],[28,8,30,11],[20,1,24,11],[55,8,57,11],[40,1,42,5],[40,8,42,11],[55,1,57,5],[52,8,54,11],[49,8,51,11],[49,1,51,5],[52,1,54,5],[76,7,77,10],[70,2,71,3],[70,4,71,5],[70,6,71,7],[46,8,48,11],[46,1,48,5],[43,1,45,5],[43,8,45,11]]}
[]
[null,"Solicitante:","SCHLUMBERGER SURENCO S A",null,null,null,null,null,"Número de certificado:",null,"DID-159-3123"]
[null,"Dirección:","KILOMETRO 1.5 VIA SIBERIA COTA PARQUE INDUSTRIAL POTRERO CHICO, COTA",null,null,null,null,null,"Número de ingreso:",null,18200]
[null,null,null," ",null,null,null,null,{"$f":"\"Intervalo de medida \"&\"(\"&D9&\"):\"","v":"Intervalo de medida (psi):"},null,0,1500]
[null,"Instrumento:",null,"MANÓMETRO",null,null,"ANALÓGICO",null,{"$f":"\"Intervalo de calibration \"&\"(\"&D9&\"):\"","v":"Intervalo de calibration (psi):"},null,0,1500]
[null,"Fabricante:",null,"STEWARTS-USA",null,null,null,null,"División de escala:",null,25,{"$f":"D9","v":"psi"}]
[null,"Modelo:",null,"NO IDENTIFICABLE",null,null,null,null,"Resolución:",null,12.5,{"$f":"D9","v":"psi"}]
[null,"Serie:",null,"CR-1419",null,null,null,null,"Clase:",null,1.6,"DEL RANGO"]
[null,"Unidad de calibración:",null,"psi","Coef senc: ",0,"%",null,"Tope en el cero:",null,"NO"]
[null,null,null,null,null,null,null,null,null,null,{"$f":"(K8*L5)/100","v":24}]
[null,"Fecha de recepción:",null,"2020-12-14",null,null,null,null,"Fecha de expedición",null,"2020-12-23"]
[null,"Fecha de calibración:",null,"2020-12-23",null,null,null,null,"Próxima calibración:"]
[]
[null,"Fluido usado :",null,"Alcohol",null,null,null,null,"Altura Patrón:",null,200,"mm"]
[null,"Cuenta con gliserina:",null,"NO",null,null,null,null,"Altura IBC:",null,240,"mm"]
[null,"Regla de desición:",null,"NO",null,null,null,null,"Suministro de regla:",null,"N/A"]
[]
[null,"Dirección de calibración:"]
[]
[null,"Suministro de regla:"]
[null," La regla de decisión usada fue dada por el cliente."]
[]
[]
[]
[]
[]
[]
[null,"Verificar que:",null,null,null,null,"SÍ","NO","OBSERVACIONES"]
[null,"El instrumento patrón cuenta con certificado de calibración vigente, trazable a una entidad acreditada o a un laboratorio nacional y cubrir todo el rango del manómetro a calibrar.",null,null,null,null,"a"]
[]
[]
[null,"La incertidumbre del patrón es al menos cuatro veces mejor que la incertidumbre máxima que se espera del manómetro a calibrar",null,null,null,null,"a"]
[]
[]
[null,"El banco generador de presión es capaz de regular con valores mejores que la resolución del manómetro a calibrar.",null,null,null,null,"a"]
[]
[]
[null,"Se usan para la medida de condiciones ambientales instrumentos con exactitud de al menos 1 °C para la medida de la temperatura y ±5% HR para la medida de la humedad relativa.",null,null,null,null,"a"]
[]
[]
[null,"El instrumento esta identificado con su marca, modelo y número de serie correspondiente o con un código interno del propietario.",null,null,null,null,"a"]
[]
[]
[null,"Se comprobó el estado de la carátula y aguja indicadora para manómetros analógicos y/o del dispositivo indicador para manómetros digitales.",null,null,null,null,"a"]
[]
[]
[null,"Se comprobaron fugas en el sistema.",null,null,null,null,"a"]
[]
[]
[null,"Se realizó la medición de la diferencia de alturas entre los niveles de referencia.",null,null,null,null,"a"]
[]
[]
[null,"Se desperezó el manómetro subiendo y bajando presión dos o tres veces hasta fondo de escala.",null,null,null,null,"a"]
[]
[]
[null,"El patrón se programó a ser posible en las mismas unidades que el manómetro a calibrar.",null,null,null,null,"a"]
[]
[]
[null,"Se comprobó que el manómetro esté identificado con su marca, modelo y número de serie correspondiente, o con un código interno del propietario?",null,null,null,null,"a"]
[]
[]
[]
[null,"PRECARGAS"]
[]
[null,null,null,null,"Valor Nominal","Lectura 1","Lectura 2","Lectura 3"]
[null,null,null,null,{"$f":"'OPERACIONES PREVIAS'!L6","v":"psi"}]
[null,null,null,null,{"$f":"'OPERACIONES PREVIAS'!L5","v":1500},1493.2,1493.2,1492.3]
[]
[null,"ESTADO DEL MANÓMETRO"]
[]
[null,null,"Presión \nNominal",null,"Lectura \nPatrón",null,"Error por Ecuación",null,"Lectura \nPatrón Corregida","Lectura \nIBC","Corrección de medida"]
[]
[null,null,"% F.S",{"$f":"'OPERACIONES PREVIAS'!$D$9","v":"psi"},{"$f":"'OPERACIONES PREVIAS'!$D$9","v":"psi"},{"$f":"IF(REGISTRO!B71=\"-30\",\"inHg\",\"psi\")","v":"psi"},{"$f":"F73","v":"psi"},{"$f":"E73","v":"psi"},{"$f":"'OPERACIONES PREVIAS'!$D$9","v":"psi"},{"$f":"'OPERACIONES PREVIAS'!$D$9","v":"psi"},{"$f":"'OPERACIONES PREVIAS'!$D$9","v":"psi"}]
[null,null,0.3,{"$f":"C74*'OPERACIONES PREVIAS'!$L$5","v":450},450.8,{"$f":"E74*REGISTRO!$P$20","v":450.8},{"$f":"F74-(a_0+(a_1*F74)+(a_2*F74^2)+(a_3*F74^3)+(a_4*F74^4)+(a_5*F74^5))","v":0.120415534482845},{"$f":"G74/REGISTRO!$P$20","v":0.120415534482845},{"$f":"E74-H74","v":450.679584465517},450,{"$f":"I74-J74","v":0.679584465517166}]
[null,null,0.6,{"$f":"C75*'OPERACIONES PREVIAS'!$L$5","v":900},902.3,{"$f":"E75*REGISTRO!$P$20","v":902.3},{"$f":"F75-(a_0+(a_1*F75)+(a_2*F75^2)+(a_3*F75^3)+(a_4*F75^4)+(a_5*F75^5))","v":0.178513576697696},{"$f":"G75/REGISTRO!$P$20","v":0.178513576697696},{"$f":"E75-H75","v":902.121486423302},900,{"$f":"I75-J75","v":2.12148642330226}]
[null,null,1,{"$f":"C76*'OPERACIONES PREVIAS'!$L$5","v":1500},1493.8,{"$f":"E76*REGISTRO!$P$20","v":1493.8},{"$f":"F76-(a_0+(a_1*F76)+(a_2*F76^2)+(a_3*F76^3)+(a_4*F76^4)+(a_5*F76^5))","v":0.190906096137269},{"$f":"G76/REGISTRO!$P$20","v":0.190906096137269},{"$f":"E76-H76","v":1493.60909390386},1500,{"$f":"I76-J76","v":-6.39090609613731}]
[null,null,null,null," ",null,null,{"$f":"IF(ABS('OPERACIONES PREVIAS'!K10)<ABS(K74),\"Requiere ajuste\",IF(ABS('OPERACIONES PREVIAS'!K10)<ABS(K75),\"Requiere ajuste\",IF(ABS('OPERACIONES PREVIAS'!K10)<ABS(K76),\"Requiere ajuste\",\" \")))","v":" "}]
[null,null,null,null," "]
[null,"OBSERVACONES",null,null," "]
[]
[]
[]
[]
[]
[]
[]
[]
[]
[null,null,"Realizo","MICHAEL VALERO",null,null,"Cargo",{"$f":"VLOOKUP(D89,REGISTRO!F169:G172,2,0)","v":"ESPECIALISTA TÉCNICO"}]

{"sheet":"REGISTRO","index":1,"n_rows":171,"n_cols":34,"rows_kept":171,"cut":false,"hidden":false,"merged":[[1,13,1,17],[2,1,2,10],[2,13,2,17],[3,1,3,3],[3,4,3,10],[5,1,5,4],[6,1,6,2],[6,3,6,4],[6,6,6,10],[7,1,7,2],[7,3,7,4],[7,6,7,7],[8,1,8,2],[8,3,8,4],[8,6,8,7],[8,21,8,22],[9,1,9,2],[9,3,9,4],[9,6,9,7],[9,21,9,22],[10,1,10,2],[10,3,10,4],[10,6,10,7],[11,3,11,4],[11,6,11,7],[12,3,12,4],[13,1,13,2],[13,3,13,4],[14,1,14,2],[14,3,14,4],[14,28,14,29],[14,31,14,32],[15,3,15,4],[17,21,17,22],[18,21,18,22],[19,21,19,22],[21,1,21,10],[22,1,22,2],[24,2,24,10],[24,20,24,21],[25,20,25,21],[29,29,29,33],[30,29,30,30],[31,29,31,30],[32,29,32,30],[33,29,33,30],[34,29,34,30],[36,29,36,30],[36,31,36,32],[40,2,40,10],[53,2,53,10],[70,1,70,6],[75,1,75,10],[100,2,100,9],[103,2,103,3],[104,2,104,3],[105,2,105,3],[106,2,106,3],[108,1,108,10],[120,3,120,8],[128,14,128,23],[132,1,132,5],[132,6,132,10],[140,13,140,20],[160,3,160,5],[160,7,160,9],[168,0,171,0],[24,1,27,1],[28,1,33,1],[34,1,39,1],[41,1,46,1],[47,1,52,1],[54,1,59,1],[60,1,65,1],[109,1,111,1],[133,1,135,1],[109,2,110,2],[133,2,135,2],[18,3,19,3],[109,3,110,3],[121,3,123,3],[133,3,135,3],[18,4,19,4],[101,4,102,4],[109,4,110,4],[121,4,123,4],[133,4,135,4],[109,5,110,5],[121,5,122,5],[133,5,135,5],[109,6,110,6],[121,6,122,6],[133,6,135,6],[109,7,110,7],[121,7,122,7],[133,7,135,7],[25,8,26,8],[103,8,106,8],[109,8,110,8],[121,8,122,8],[133,8,135,8],[25,9,26,9],[103,9,106,9],[109,9,110,9],[122,9,124,9],[133,9,135,9],[25,10,26,10],[109,10,110,10],[122,10,124,10],[133,10,135,10],[140,12,142,12],[3,13,4,13],[129,13,131,13],[142,13,143,13],[3,14,4,14],[129,14,131,14],[142,14,143,14],[3,15,4,15],[24,15,26,15],[129,15,131,15],[142,15,143,15],[3,16,4,16],[24,16,26,16],[129,16,131,16],[142,16,143,16],[3,17,4,17],[24,17,26,17],[129,17,131,17],[142,17,143,17],[24,18,26,18],[129,18,131,18],[142,18,143,18],[129,19,131,19],[142,19,143,19],[129,20,131,20],[142,20,143,20],[129,21,131,21],[129,22,131,22],[129,23,131,23],[144,23,145,23],[129,24,131,24],[144,24,145,24],[129,25,131,25],[129,26,131,26],[1,27,3,27],[129,27,131,27],[1,28,3,28],[101,2,102,3],[144,21,145,22],[12,6,13,7],[24,13,26,14],[12,9,13,10],[25,2,26,3],[25,4,26,5],[25,6,26,7],[145,2,146,9],[15,6,18,10],[101,5,102,6]]}
[null,12345]
[null,null,null,null,null,null,null,null,null,null,null,null,null,"DATOS DE CALIBRACIÓN DEL PATRÓN",null,null,null,null,null,"Sí",null,"Tipo de fluido","Densidad","U",null,null,null,"Resolución Patrón","Resolución IBC",null,0,0]
[null,"CONDICIONES AMBIENTALES",null,null,null,null,null,null,null,null,null,null,null,{"$f":"VLOOKUP(D10,X26:Z35,3,0)","v":"DATOS_3000"},null,null,null,null,null,"NO",null,"Aceite",863.3,86.3,"kg/m3",null,null,null,null,null,1,"0.0"]
[null,"CALIBRACIÓN EN:",null,null,"INSTALACIONES PERMANENTES",null,null,null,null,null,null,null,null,"Lectura \nPatrón","Lectura \nIBC","Error de \nMedición","U\nExpandida","Deriva",null,null,null,"Alcohol",812.8,81.28,"kg/m3",null,null,null,null,null,2,"0.00"]
[null,null,null,null,null,null,null,null,null,null,null,null,null,null,null,null,null,null,null,null,null,"Agua ",998.193,0.01,"kg/m3",null,null,"psi","psi",null,3,"0.000"]
[null,"DATOS DEL PATRÓN",null,null,null,null,null,null,null,null,null,null,null,"psi","psi","psi","psi","psi",null,null,null,"Aire",0.8876,0.012,"kg/m3",null,"Resolución",{"$f":"$D$17","v":0},{"$f":"'OPERACIONES PREVIAS'!$K$7","v":12.5},null,4,"0.0000"]
[null,"Patrón usado:",null,{"$f":"IF(D10<0,\"VACÚOMETRO DIGITAL\",\"MANÓMETRO DIGITAL\")","v":"MANÓMETRO DIGITAL"},null,null,"CORRECCIÓN POR DIFERENCIA DE ALTURAS",null,null,null,null,null,null,{"$f":"INDIRECT(N3)","v":296.25},296.2,-0.0500000000000114,0.084,0.0300000000000114,null,null,null,null,null,null,null,null,"Decimales",{"$f":"IF((LEN(AB6)-LEN(INT(AB6))-1)<0,0,(LEN(AB6)-LEN(INT(AB6))-1))","v":0},{"$f":"IF((LEN(AC6)-LEN(INT(AC6))-1)<0,0,(LEN(AC6)-LEN(INT(AC6))-1))","v":1},null,5,"0.00000"]
[null,"Marca:",null,{"$f":"VLOOKUP($D$10,LISTADO_PATRONES,2,0)","v":"ADDITEL"},null,null,"Magnitud",null,"Valor","U","Unidad",null,null,592.75,592.6,-0.149999999999977,0.086,0.109999999999977,null,null,null,"Incertidumbre de la regla patrón",null,null,null,null,"Formato",{"$f":"VLOOKUP(AB7,AE2:AF11,2,FALSE)","v":0},{"$f":"VLOOKUP(AC7,AE2:AF11,2,FALSE)","v":"0.0"},null,6,"0.000000"]
[null,"Modelo:",null,{"$f":"VLOOKUP($D$10,LISTADO_PATRONES,3,0)","v":"ADT672"},null,null,"Diferencia de alturas (h):",null,{"$f":"(MAX('CORRECCIÓN EQUIPOS AUX'!Q94,'CORRECCIÓN EQUIPOS AUX'!Q97)-MIN('CORRECCIÓN EQUIPOS AUX'!Q94,'CORRECCIÓN EQUIPOS AUX'!Q97))/1000","v":0.0800024595200001},{"$f":"V10","v":3.15553989041518e-5},"m",null,null,896.47,896.3,-0.170000000000073,0.09,0.130000000000073,null,"ANALÓGICO",null,"U Regla patrón",null,null,null,null,null,null,null,null,7,"0.0000000"]
[null,"Rango de medida:",null,3000,null,null,"Densidad del fluido (ρf):",null,{"$f":"VLOOKUP('OPERACIONES PREVIAS'!D14,V3:X6,2,0)","v":812.8},{"$f":"VLOOKUP('OPERACIONES PREVIAS'!D14,V3:X6,3,0)","v":81.28},"kg/m3",null,null,1192.97,1192.8,-0.170000000000073,0.095,0.180000000000064,null,"DIGITAL",null,{"$f":"'CORRECCIÓN EQUIPOS AUX'!H87/1000","v":3.15553989041518e-5},null,null,null,null,null,null,null,null,8,"0.00000000"]
[null,"Certificado No.",null,{"$f":"VLOOKUP($D$10,LISTADO_PATRONES,6,0)","v":"LPR181275a"},null,null,"Densidad del aire (ρa):",null,{"$f":"W6","v":0.8876},0.012,"kg/m3",null,null,1489.47,1489.3,-0.170000000000073,0.101,0.180000000000064,null,null,null,null,null,null,null,null,null,null,null,null,9,"0.000000000"]
[null,"Fecha de calibración:",null,{"$f":"VLOOKUP($D$10,LISTADO_PATRONES,7,0)","v":"2018-10-12"},null,null,"Aceleración gravedad (gl):",null,9.8,0.05,"m/s2",null,null,1793.2,1793,-0.200000000000045,0.109,0.380000000000045,null,"Del rango"]
[null,"Próxima calibración:",null,{"$f":"VLOOKUP($D$10,LISTADO_PATRONES,8,0)","v":"2020-10-12"},null,null,"Corrección por diferencia de alturas (ΔNR)",null,{"$f":"(I10-I11)*I12*I9","v":636.558891364904},"ΔNR = ((ρf - ρa) ∙ gl ∙ h) ",null,null,null,2089.69,2089.5,-0.190000000000055,0.119,0.2800000000002,null,"De lectura"]
[null,"Serie interna:",null,{"$f":"VLOOKUP($D$10,LISTADO_PATRONES,4,0)","v":"CS-MP-010 / 27312320013"},null,null,null,null,{"$f":"I13/VLOOKUP(J103,CONVERSION,MATCH(I103,'TABLA DE CONVERSIÓN'!$B$2:$M$2,0)+1,0)","v":0.0923250252894812},null,null,null,null,2386.19,2386,-0.190000000000055,0.138,0.290000000000418]
[null,"Precisión:",null,{"$f":"VLOOKUP($D$10,LISTADO_PATRONES,9,0)","v":0.00025},null,null,null,null,null,null,null,null,null,2689.91,2689.7,-0.210000000000036,0.159,0.2800000000002,null,"MANÓMETRO",null,null,null,null,null,null,null,null,"CMC",null,null,"CONVERCIÓN"]
[null,"Deriva:",null,{"$f":"VLOOKUP($D$10,LISTADO_PATRONES,11,0)","v":0.75},null,null,"NOTA: Se debe asegurar que las condiciones ambientales, en cuanto a temperatura y humedad, estarán dentro de los márgenes especificados por los fabricantes de manómetro a calibrar y del manómetro utilizado como patrón.",null,null,null,null,null,null,3000.86,3000.6,-0.260000000000218,0.18,0.370000000000346,null,"MANOVACUÓMETRO",null,null,null,null,null,null,null,null,"INTERVALO","psi",null,"INTERVALO",{"$f":"'OPERACIONES PREVIAS'!D9","v":"psi"}]
[null,"Resolución:",null,null,{"$f":"'OPERACIONES PREVIAS'!D9","v":"psi"},null,null,null,null,null,null,null,null,null,null,null,null,null,null,"VACUÓMETRO",null,null,null,null,null,null,null,null,-10,0.034,null,{"$f":"AC17/$P$20","v":-10},{"$f":"AD17/$P$20","v":0.034}]
[null,"Coef senc: ",null,0,"%",null,null,null,null,null,null,null,null,"Unidad de calibración:",null,{"$f":"'OPERACIONES PREVIAS'!$D$9","v":"psi"},null,null,null,"TRANSMISOR DE PRESIÓN ESTÁTICA",null,"metodo",null,null,null,null,null,null,50,0.033,null,{"$f":"AC18/$P$20","v":50},{"$f":"AD18/$P$20","v":0.033}]
[null,"  patrón",{"$f":"D10*D15","v":0.75},"Relación de \nU (TAR)",{"$f":"C20/C19","v":32},null,null,null,null,null,null,null,null,"Unidad del patrón:",null,{"$f":"$F$28","v":"psi"},null,null,null,"TRANSMISOR DE PRESIÓN DIFERENCIA",null,"U metodo",null,0.0149538338522267,"psi",null,null,null,300,0.044,null,300,0.044]
[null,"  IBC",{"$f":"('OPERACIONES PREVIAS'!L4*'OPERACIONES PREVIAS'!K8)/100","v":24},null,null,null,null,null,null,null,null,null,null,"Conversión:",{"$f":"1&\" \"&P18&\" \"&\" = \"","v":"1 psi  = "},{"$f":"VLOOKUP($P$18,CONVERSION,MATCH($P$19,'TABLA DE CONVERSIÓN'!$B$2:$M$2,0)+1,FALSE)","v":1},{"$f":"$P$19","v":"psi"},null,null,"REGISTRADOR DE PRESIÓN ESTÁTICA ",null,"Incertidumbre metodo",null,{"$f":"IF('OPERACIONES PREVIAS'!D9=\"psi\",REGISTRO!X19,IF('OPERACIONES PREVIAS'!D9=\"bar\",REGISTRO!X19/REGISTRO!P20,REGISTRO!X19/REGISTRO!P20))","v":0.0149538338522267},null,null,null,null,3000,0.21,null,3000,0.21]
[null,null,null,null,null,null,null,null,null,null,null,null,null,"Unidad del SI:",null,"kPa",null,null,null,"REGISTRADOR DE PRESIÓN DIFERENCIAL",null,null,null,null,null,null,null,null,10000,1.4,null,10000,1.4]
[null,"TOMA DE DATOS",null,null,null,null,null,null,null,null,null,null,null,"Conversión:",{"$f":"1&\" \"&'OPERACIONES PREVIAS'!D9&\" \"&\" = \"","v":"1 psi  = "},{"$f":"VLOOKUP('OPERACIONES PREVIAS'!D9,CONVERSION,IF(Q22=\"kPa\",3,IF(Q22=\"MPa\",4)),0)","v":6.89476},{"$f":"$P$21","v":"kPa"},null,null,"MODULO DE PRESIÓN ESTATICA ",null,null,null,null,null,null,null,null,36000,8.9,null,36000,8.9]
[null,"Hora inicio ",null,"08:30: AM","hh:mm",null,null,null,null,null,null,null,null,"Número de lecturas:",null,{"$f":"IF('OPERACIONES PREVIAS'!K8>=0.25,4,6)","v":4},null,null,null,"MODULO DE PRESIÓN DIFERENCIAL"]
[]
[null,"Sentido de la Calibración","1ra Serie de Medición",null,null,null,null,null,null,null,null,null,null,"Lectura del Patrón",null,"U Patrón\nk=2","U Patrón\nk=2","Deriva del Patrón","Deriva del Patrón",null,{"$f":"VLOOKUP(D10,X26:Z35,2,0)","v":"COEFICIENTES_3000"},null,null,"Patrón","Coeficientes ","Datos de cal"]
[null,null,"Presión \nNominal",null,"Lectura \nPatrón",null,"Error por Ecuación",null,"Lectura \nPatrón Corregida","Lectura \nIBC","Corrección de Medida",null,null,null,null,null,null,null,null,null,"Coeficientes de Ajuste",null,null,15,"COEFICIENTES_15","DATOS_15"]
[null,null,null,null,null,null,null,null,null,null,null,null,null,null,null,null,null,null,null,null,"a0 (intercepto)",{"$f":"INDIRECT(U25)","v":0.2249},null,50,"COEFICIENTES_50","DATOS_50"]
[null,null,"% F.S",{"$f":"'OPERACIONES PREVIAS'!$D$9","v":"psi"},{"$f":"'OPERACIONES PREVIAS'!$D$9","v":"psi"},{"$f":"IF(D10=\"-30\",\"inHg\",\"psi\")","v":"psi"},{"$f":"F28","v":"psi"},{"$f":"E28","v":"psi"},{"$f":"'OPERACIONES PREVIAS'!$D$9","v":"psi"},{"$f":"'OPERACIONES PREVIAS'!$D$9","v":"psi"},{"$f":"'OPERACIONES PREVIAS'!$D$9","v":"psi"},null,null,{"$f":"$P$18","v":"psi"},{"$f":"$P$19","v":"psi"},{"$f":"R6","v":"psi"},{"$f":"N28","v":"psi"},{"$f":"P28","v":"psi"},{"$f":"Q28","v":"psi"},null,"a1",0.9986,null,300,"COEFICIENTES_300","DATOS_300"]
[null,"Ascenso\n▲",{"$f":"IF('OPERACIONES PREVIAS'!K9=\"NO\",0%,10%)","v":0},{"$f":"C29*'OPERACIONES PREVIAS'!$L$5","v":0},0,{"$f":"E29*$P$20","v":0},{"$f":"F29-(a_0+(a_1*F29)+(a_2*F29^2)+(a_3*F29^3)+(a_4*F29^4)+(a_5*F29^5))","v":-0.2249},{"$f":"G29/$P$20","v":-0.2249},{"$f":"E29-H29","v":0.2249},0,{"$f":"I29-J29","v":0.2249},null,null,{"$f":"C138","v":0.2249},{"$f":"N29*$P$20","v":0.2249},{"$f":"IF(ABS(O29)<=ABS($N$7),$Q$7,IF(ABS(O29)<=ABS($N$8),$Q$8,IF(ABS(O29)<=ABS($N$9),$Q$9,IF(ABS(O29)<=ABS($N$10),$Q$10,IF(ABS(O29)<=ABS($N$11),$Q$11,IF(ABS(O29)<=ABS($N$12),$Q$12,IF(ABS(O29)<=ABS($N$13),$Q$13,IF(ABS(O29)<=ABS($N$14),$Q$14,IF(ABS(O29)<=ABS($N$15),$Q$15,IF(ABS(O29)<=ABS($N$16),$Q$16,$Q$16))))))))))","v":0.084},{"$f":"P29/$P$20","v":0.084},{"$f":"IF(ABS(O29)<=ABS($N$7),$R$7,IF(ABS(O29)<=ABS($N$8),$R$8,IF(ABS(O29)<=ABS($N$9),$R$9,IF(ABS(O29)<=ABS($N$10),$R$10,IF(ABS(O29)<=ABS($N$11),$R$11,IF(ABS(O29)<=ABS($N$12),$R$12,IF(ABS(O29)<=ABS($N$13),$R$13,IF(ABS(O29)<=ABS($N$14),$R$14,IF(ABS(O29)<=ABS($N$15),$R$15,IF(ABS(O29)<=ABS($N$16),$R$16,$R$16))))))))))","v":0.0300000000000114},{"$f":"R29/$P$20","v":0.0300000000000114},null,"a2",1.884e-6,null,1000,"COEFICIENTES_1000","DATOS_1000"]
[null,null,0.2,{"$f":"C30*'OPERACIONES PREVIAS'!$L$5","v":300},302.4,302.4,0.056872589025204,0.056872589025204,302.343127410975,300,2.34312741097477,null,null,301.893377822183,301.893377822183,{"$f":"IF(ABS(O30)<=ABS($N$7),$Q$7,IF(ABS(O30)<=ABS($N$8),$Q$8,IF(ABS(O30)<=ABS($N$9),$Q$9,IF(ABS(O30)<=ABS($N$10),$Q$10,IF(ABS(O30)<=ABS($N$11),$Q$11,IF(ABS(O30)<=ABS($N$12),$Q$12,IF(ABS(O30)<=ABS($N$13),$Q$13,IF(ABS(O30)<=ABS($N$14),$Q$14,IF(ABS(O30)<=ABS($N$15),$Q$15,IF(ABS(O30)<=ABS($N$16),$Q$16,$Q$16))))))))))","v":0.086},{"$f":"P30/$P$20","v":0.086},0.109999999999977,{"$f":"R30/$P$20","v":0.109999999999977},null,"a3",-1.219e-9,null,3000,"COEFICIENTES_3000","DATOS_3000",null,null,null,"CONDICIONES AMBIENTALES"]
[null,null,0.4,{"$f":"C31*'OPERACIONES PREVIAS'!$L$5","v":600},600.7,600.7,0.155268466475491,0.155268466475491,600.544731533525,600,0.544731533524555,null,null,599.244941807384,599.244941807384,0.09,{"$f":"P31/$P$20","v":0.09},0.130000000000073,{"$f":"R31/$P$20","v":0.130000000000073},null,"a4",3.735e-13,null,5000,"COEFICIENTES_5000","DATOS_5000",null,null,null,"Magnitud",null,"Valor","U","Unidad"]
[null,null,0.6,{"$f":"C32*'OPERACIONES PREVIAS'!$L$5","v":900},899.3,899.3,0.178438495879163,0.178438495879163,899.121561504121,900,-0.878438495879209,null,null,895.146665148803,895.146665148803,0.09,{"$f":"P32/$P$20","v":0.09},0.130000000000073,0.130000000000073,null,"a5",-4.369e-17,null,10000,"COEFICIENTES_10000","DATOS_10000",null,null,null,"Presión atmosférica",null,700,1.9,"hPa"]
[null,null,0.8,{"$f":"C33*'OPERACIONES PREVIAS'!$L$5","v":1200},1203,1203,0.182844870953886,0.182844870953886,1202.81715512905,1200,2.81715512904611,null,null,1200.99218415036,1200.99218415036,0.101,0.101,0.180000000000064,0.180000000000064,null,null,null,null,36000,"COEFICIENTES_36000","DATOS_36000",null,null,null,"Temperatura máxima",null,21.1,0.49,"°C"]
[null,null,1,{"$f":"C34*'OPERACIONES PREVIAS'!$L$5","v":1500},1486.1,1486.1,0.190604165084096,0.190604165084096,1485.90939583492,1500,-14.0906041650842,null,null,1492.5341347847,1492.5341347847,0.109,0.109,0.380000000000045,0.380000000000045,null,null,null,null,-15,"COEFICIENTES_Fluke_Menos_15","DATOS_Fluke_Menos_15",null,null,null,"Temperatura mínima",null,20.2,0.49,"°C"]
[null,"Descenso\n▼",{"$f":"C34","v":1},{"$f":"D34","v":1500},1499.2,1499.2,0.191120286644036,0.191120286644036,1499.00887971336,1500,-0.991120286643991,null,null,null,null,null,null,null,null,null,null,null,null,-30,"COEFICIENTES_Ametek_Menos_30inHg","DATOS_Ametek_Menos_30inHg",null,null,null,"Humedad relativa",null,48,9.9,"%HR"]
[null,null,{"$f":"C33","v":0.8},{"$f":"D33","v":1200},1199.2,1199.2,0.18278446072236,0.18278446072236,1199.01721553928,1200,-0.982784460722314]
[null,null,{"$f":"C32","v":0.6},{"$f":"D32","v":900},890.7,890.7,0.178214167967099,0.178214167967099,890.521785832033,900,-9.47821416796705,null,null,null,null,null,null,null,null,null,null,null,null,null,null,null,null,null,null,"Variación en temperatura",null,{"$f":"MAX(AF33:AF34)-MIN(AF33:AF34)","v":0.900000000000002},null,"°C"]
[null,null,{"$f":"C31","v":0.4},{"$f":"D31","v":600},597.9,597.9,0.154815169342783,0.154815169342783,597.745184830657,600,-2.25481516934281]
[null,null,{"$f":"C30","v":0.2},{"$f":"D30","v":300},302.5,302.5,0.0569281279980487,0.0569281279980487,302.443071872002,300,2.44307187200195]
[null,null,{"$f":"C29","v":0},{"$f":"D29","v":0},0,0,-0.2249,-0.2249,0.2249,0,0.2249]
[]
[null,"Ascenso\n▲",{"$f":"C29","v":0},{"$f":"D29","v":0},0,{"$f":"E42*$P$20","v":0},{"$f":"F42-(a_0+(a_1*F42)+(a_2*F42^2)+(a_3*F42^3)+(a_4*F42^4)+(a_5*F42^5))","v":-0.2249},{"$f":"G42/$P$20","v":-0.2249},{"$f":"E42-H42","v":0.2249},0,{"$f":"I42-J42","v":0.2249}]
[null,null,0.2,300,301.4,301.4,0.0563161304291384,0.0563161304291384,301.343683869571,300,1.34368386957084]
[null,null,0.4,600,600.5,600.5,0.15523629747247,0.15523629747247,600.344763702528,600,0.34476370252753,null,null,null,null,null,null,null,null,null,null,null,null,"Curva de calibración"]
[null,null,0.6,900,899.8,899.8,0.178451120712793,0.178451120712793,899.621548879287,900,-0.378451120712839,null,null,null,null,null,null,null,null,null,null,null,null,"Título","Curvas de calibración"]
[null,null,0.8,1200,1203,1203,0.182844870953886,0.182844870953886,1202.81715512905,1200,2.81715512904611,null,null,null,null,null,null,null,null,null,null,null,null,"Título eje x",{"$f":"\"Corrección de la medición en \"&\"(\"&'OPERACIONES PREVIAS'!D9&\")\"","v":"Corrección de la medición en (psi)"}]
[null,null,1,1500,1486.1,1486.1,0.190604165084096,0.190604165084096,1485.90939583492,1500,-14.0906041650842,null,null,null,null,null,null,null,null,null,null,null,null,"Título eje y",{"$f":"\"Lectura en \"&\"(\"&'OPERACIONES PREVIAS'!D9&\")\"","v":"Lectura en (psi)"}]
[null,"Descenso\n▼",1,1500,1499.5,1499.5,0.191132244389109,0.191132244389109,1499.30886775561,1500,-0.691132244389109]
[null,null,0.8,1200,1199.5,1199.5,0.182789195913983,0.182789195913983,1199.31721080409,1200,-0.682789195913983]
[null,null,0.6,900,891.5,891.5,0.178235620228747,0.178235620228747,891.321764379771,900,-8.67823562022875]
[null,null,0.4,600,598.5,598.5,0.154912837172446,0.154912837172446,598.345087162828,600,-1.65491283717245,null,null,null,null,null,null,null,null,null,null,null,null,"Valor Nominal"," Ascenso 1","Descenso 1"," Ascenso 2","Descenso 2"," Ascenso 3","Descenso 3","EMP (+)","EPM (-)"]
[null,null,0.2,300,301.5,301.5,0.0563718638142632,0.0563718638142632,301.443628136186,300,1.44362813618574,null,null,null,null,null,null,null,null,null,null,null,null,{"$f":"IF('OPERACIONES PREVIAS'!K9=\"SI\",\"\",D29)","v":0},{"$f":"IF('OPERACIONES PREVIAS'!K9=\"SI\",\"\",K29)","v":0.2249},{"$f":"IF('OPERACIONES PREVIAS'!K9=\"SI\",\"\",K40)","v":0.2249},{"$f":"IF('OPERACIONES PREVIAS'!K9=\"SI\",\"\",K42)","v":0.2249},{"$f":"IF('OPERACIONES PREVIAS'!K9=\"SI\",\"\",K53)","v":0.2249},{"$f":"IF('OPERACIONES PREVIAS'!K9=\"SI\",\"\",K55)","v":0.2249},{"$f":"IF('OPERACIONES PREVIAS'!K9=\"SI\",\"\",K66)","v":0.2249},{"$f":"Y134","v":24},{"$f":"Z134","v":-24}]
[null,null,0,{"$f":"D40","v":0},0,0,-0.2249,-0.2249,0.2249,0,0.2249,null,null,{"$f":"REGISTRO!AF37:AG37&\" \"","v":{"$error":"#VALUE!"}},null,null,null,null,null,null,null,null,null,{"$f":"D30","v":300},{"$f":"K30","v":2.34312741097477},{"$f":"K39","v":2.44307187200195},{"$f":"K43","v":1.34368386957084},{"$f":"K52","v":1.44362813618574},{"$f":"K56","v":0.2249},{"$f":"K65","v":0.2249},24,-24]
[null,null,"3ra Serie de Medición (Para Manómetros < 0,25%)",null,null,null,null,null,null,null,null,null,null,null,null,null,null,null,null,null,null,null,null,{"$f":"D31","v":600},{"$f":"K31","v":0.544731533524555},{"$f":"K38","v":-2.25481516934281},{"$f":"K44","v":0.34476370252753},{"$f":"K51","v":-1.65491283717245},{"$f":"K57","v":0.2249},{"$f":"K64","v":0.2249},24,-24]
[null,"Ascenso\n▲",{"$f":"C42","v":0},0,null,{"$f":"E55*$P$20","v":0},{"$f":"F55-(a_0+(a_1*F55)+(a_2*F55^2)+(a_3*F55^3)+(a_4*F55^4)+(a_5*F55^5))","v":-0.2249},{"$f":"G55/$P$20","v":-0.2249},{"$f":"E55-H55","v":0.2249},null,{"$f":"I55-J55","v":0.2249},null,null,null,null,null,null,null,null,null,null,null,null,{"$f":"D32","v":900},{"$f":"K32","v":-0.878438495879209},{"$f":"K37","v":-9.47821416796705},{"$f":"K45","v":-0.378451120712839},{"$f":"K50","v":-8.67823562022875},{"$f":"K58","v":0.2249},{"$f":"K63","v":0.2249},24,-24]
[null,null,0.2,300,null,0,-0.2249,-0.2249,0.2249,null,0.2249,null,null,null,null,null,null,null,null,null,null,null,null,{"$f":"D33","v":1200},{"$f":"K33","v":2.81715512904611},{"$f":"K36","v":-0.982784460722314},{"$f":"K46","v":2.81715512904611},{"$f":"K49","v":-0.682789195913983},{"$f":"K59","v":0.2249},{"$f":"K62","v":0.2249},24,-24]
[null,null,0.4,600,null,0,-0.2249,-0.2249,0.2249,null,0.2249,null,null,null,null,null,null,null,null,null,null,null,null,{"$f":"D34","v":1500},{"$f":"K34","v":-14.0906041650842},{"$f":"K35","v":-0.991120286643991},{"$f":"K47","v":-14.0906041650842},{"$f":"K48","v":-0.691132244389109},{"$f":"K60","v":0.2249},{"$f":"K55","v":0.2249},24,-24]
[null,null,0.6,900,null,0,-0.2249,-0.2249,0.2249,null,0.2249]
[null,null,0.8,1200,null,0,-0.2249,-0.2249,0.2249,null,0.2249,null,null,null,null,null,null,null,null,null,null,null,null,"Diagrama de calibración"]
[null,null,1,1500,null,0,-0.2249,-0.2249,0.2249,null,0.2249,null,null,null,null,null,null,null,null,null,null,null,null,"Titulo","Diagrama de calibración"]
[null,"Descenso\n▼",1,1500,null,0,-0.2249,-0.2249,0.2249,null,0.2249,null,null,null,null,null,null,null,null,null,null,null,null,"Titulo eje x",{"$f":"\"Corrección ± Incertidumbre \"&\"(\"&'OPERACIONES PREVIAS'!D9&\")\"","v":"Corrección ± Incertidumbre (psi)"}]
[null,null,0.8,1200,null,0,-0.2249,-0.2249,0.2249,null,0.2249,null,null,null,null,null,null,null,null,null,null,null,null,"Titulo eje y",{"$f":"\"Valor Nominal \"&\"(\"&'OPERACIONES PREVIAS'!$D$9&\")\"","v":"Valor Nominal (psi)"}]
[null,null,0.6,900,null,0,-0.2249,-0.2249,0.2249,null,0.2249,null,null,null,null,null,null,null,null,null,null,null,null,"Valor eje x",{"$f":"IF('OPERACIONES PREVIAS'!K9=\"NO\",\"C100:C105\",IF('OPERACIONES PREVIAS'!K9=\"SI\",\"C101:C105\",))","v":"C100:C105"}]
[null,null,0.4,600,null,0,-0.2249,-0.2249,0.2249,null,0.2249,null,null,null,null,null,null,null,null,null,null,null,null,"Valor eje y",{"$f":"IF('OPERACIONES PREVIAS'!K9=\"NO\",\"E100:E105\",IF('OPERACIONES PREVIAS'!K9=\"SI\",\"E101:E105\",))","v":"E100:E105"}]
[null,null,0.2,300,null,0,-0.2249,-0.2249,0.2249,null,0.2249]
[null,null,0,0,null,0,-0.2249,-0.2249,0.2249,null,0.2249,null,null,null,null,null,null,null,null,null,null,null,null,"Valor Nominal","Corrección Final","U"]
[null,null,null,null,null,null,null,null,null,null,null,null,null,null,null,null,null,null,null,null,null,null,null,0,{"$f":"Y68","v":0.317225025289481},{"$f":"Z68","v":7.11603311197058}]
[null,"Hora final","09:30: PM","hh:mm","Temp Min",18.7,"% HR Min",63.1,"Pres atm Min",751.2,"hPa",null,null,null,null,null,null,null,null,null,null,null,null,{"$f":"IF('OPERACIONES PREVIAS'!K9=\"SI\",\"\",D29)","v":0},{"$f":"IF('OPERACIONES PREVIAS'!K9=\"SI\",\"\",E138)","v":0.317225025289481},{"$f":"IF('OPERACIONES PREVIAS'!K9=\"SI\",\"\",VALUE(F138))","v":7.11603311197058}]
[null,null,"                      ",null,"Temp Máx",18.9,"%HR Máx",63.5,"Pres atm Máx",752.2,"hPa",null,null,null,null,null,null,null,null,null,null,null,null,{"$f":"D30","v":300},{"$f":"E139","v":1.98570284747279},{"$f":"VALUE(F139)","v":7.16123158254795}]
[null,null,null,null,null,null,null,null,null,null,null,null,null,null,null,null,null,null,null,null,null,null,null,{"$f":"D31","v":600},{"$f":"E140","v":-0.662733167326339},{"$f":"VALUE(F140)","v":7.29045816344213}]
[null,"Correcciones",null,null,null,null,null,null,null,"Variación",null,null,null,null,null,null,null,null,null,null,null,null,null,{"$f":"D32","v":900},{"$f":"E141","v":-4.76100982590754},{"$f":"VALUE(F141)","v":8.62397299723832}]
[null,"Temp Mín",21.6,"% HR Mín",61.5,"Pres atm Min",749.2,null,"Temperatura",{"$f":"C73-C72","v":0.199999999999999},"°C",null,null,null,null,null,null,null,null,null,null,null,null,{"$f":"D33","v":1200},{"$f":"E142","v":1.08450917565346},{"$f":"VALUE(F142)","v":7.43151663325699}]
[null,"Temp Máx",21.8,"%HR Máx",61.8,"Pres atm Máx",749.5,null,"Humedad",{"$f":"E73-E72","v":0.299999999999997},"% HR",null,null,null,null,null,null,null,null,null,null,null,null,{"$f":"D34","v":1500},{"$f":"E143","v":-7.373540190011},{"$f":"VALUE(F143)","v":10.4024586104981}]
[null,null,null,null,null,null,null,null,"Pres atm.",{"$f":"G73-G72","v":0.299999999999955},{"$f":"K68","v":"hPa"},null,null,null,null,null,null,null,null,null,null,null,null,"Diagrama de Incertidumbres"]
[]
[null,"GRAFICA CONDICIONES AMBIENTALES (Opcional)",null,null,null,null,null,null,null,null,null,null,null,null,null,null,null,null,null,null,null,null,null,"Titulo eje x",{"$f":"\"Incertidumbre \"&\"(\"&'OPERACIONES PREVIAS'!D9&\")\"","v":"Incertidumbre (psi)"}]
[null,null,null,null,null,null,null,null,null,null,null,null,null,null,null,null,null,null,null,null,null,null,null,"Titulo eje y",{"$f":"\"Valor Nominal \"&\"(\"&'OPERACIONES PREVIAS'!D9&\")\"","v":"Valor Nominal (psi)"}]
[null,null,null,null,null,null,null,null,null,null,null,null,null,null,null,null,null,null,null,null,null,null,null,"Valor eje x",{"$f":"IF(C29=\"NO\",\"C100:C105\",IF(C29=\"SI\",\"C101:C105\",))","v":0}]
[null,null,null,null,null,null,null,null,null,null,null,null,null,null,null,null,null,null,null,null,null,null,null,"Valor eje y",{"$f":"IF(C29=\"NO\",\"E100:E105\",IF(C29=\"SI\",\"E101:E105\",))","v":0}]
[]
[]
[]
[]
[]
[]
[]
[]
[]
[]
[]
[]
[]
[]
[]
[]
[]
[]
[]
[]
[]
[null,null,"ESTIMACIÓN DE LA INCERTIDUMBRE POR CORRECCIÓN DE ALTURAS"]
[null,null,"Magnitud",null,"Incertidumbre típica","Coeficiente de sensibilidad",null,"u Estándar","u Estándar","u Estándar"]
[null,null,null,null,null,null,null,"Pa","Pa",{"$f":"'OPERACIONES PREVIAS'!$D$9","v":"psi"}]
[null,null,"Diferencia de alturas (h):",null,{"$f":"J9/2","v":1.57776994520759e-5},"(ρf-ρa)*gl",{"$f":"(I10-I11)*I12","v":7956.74152},{"$f":"G104*E104","v":0.125539076320413},{"$f":"SQRT(SUMSQ(H104:H107))","v":18.4679215740201},{"$f":"I104/VLOOKUP(J103,CONVERSION,MATCH(I103,'TABLA DE CONVERSIÓN'!$B$2:$M$2,0)+1,0)","v":0.00267854451409767}]
[null,null,"Densidad del fluido (ρf):",null,{"$f":"J10/SQRT(12)","v":23.4635149398664},"gl * h",{"$f":"I12*I9","v":0.784024103296001},{"$f":"G105*E105","v":18.3959612609011}]
[null,null,"Densidad del aire (ρa):",null,{"$f":"J11/SQRT(12)","v":0.00346410161513775},"-gl * h",{"$f":"-I12*I9","v":-0.784024103296001},{"$f":"G106*E106","v":-0.00271593916253461}]
[null,null,"Aceleración gravedad (gl):",null,{"$f":"J12/2","v":0.025},"(ρf-ρa)*h",{"$f":"(I10-I11)*I9","v":64.9549889147861},{"$f":"G107*E107","v":1.62387472286965}]
[]
[null,"ESTIMACIÓN DE INCERTIDUMBRES ESTÁNDAR"]
[null,"Presión \nNominal","u\nRepetibilidad","u\nResolución","u\nHistéresis","u\nTemp IBC *cs","u Nivel de referencia","u\nCal Patrón","u\nDeriva Patrón","u\nTemp Patrón*cs","u\nCombinada"]
[]
[null,null,"u(σ)","u(δRes)","u(δHis)","u(δTem)","u(ΔNR)","u(δCal)","u(δDer)","u(δTem)","uc"]
[null,"MPa",{"$f":"'OPERACIONES PREVIAS'!$D$9","v":"psi"},{"$f":"'OPERACIONES PREVIAS'!$D$9","v":"psi"},{"$f":"'OPERACIONES PREVIAS'!$D$9","v":"psi"},{"$f":"'OPERACIONES PREVIAS'!$D$9","v":"psi"},{"$f":"'OPERACIONES PREVIAS'!$D$9","v":"psi"},{"$f":"'OPERACIONES PREVIAS'!$D$9","v":"psi"},{"$f":"'OPERACIONES PREVIAS'!$D$9","v":"psi"},{"$f":"'OPERACIONES PREVIAS'!$D$9","v":"psi"},{"$f":"'OPERACIONES PREVIAS'!$D$9","v":"psi"}]
[null,{"$f":"$D$29","v":0},{"$f":"O134/SQRT($P$23-1)","v":0},{"$f":"T134/SQRT(12)","v":3.60843918243516},{"$f":"P134/SQRT(12)","v":0},{"$f":"X134/SQRT(12)","v":0},{"$f":"$J$104","v":0.00267854451409767},{"$f":"U134/2","v":0.042},{"$f":"V134/SQRT(12)","v":0.00866025403784767},{"$f":"W134/SQRT(12)","v":0},{"$f":"SQRT(SUMSQ(C114:J114,$X$20))","v":3.60872596979612}]
[null,{"$f":"$D$30","v":300},{"$f":"O135/SQRT($P$23-1)","v":0.408021117193305},{"$f":"T135/SQRT(12)","v":3.60843918243516},0.0288514807390266,0,0.00267854451409767,0.043,0.0317542648054229,{"$f":"J114","v":0},{"$f":"SQRT(SUMSQ(C115:J115,$X$20))","v":3.63197399473492}]
[null,{"$f":"$D$31","v":600},{"$f":"O136/SQRT($P$23-1)","v":0.0816365251523021},3.60843918243516,0.8081595212547,0,0.00267854451409767,0.045,0.0375277674973467,{"$f":"J115","v":0},3.69922745886865]
[null,{"$f":"$D$32","v":900},0.204118991165185,3.60843918243516,2.48254139962516,0,0.00267854451409767,0.045,0.0375277674973467,{"$f":"J116","v":0},4.3851081881547]
[null,{"$f":"$D$33","v":1200},0,3.60843918243516,1.09694807252856,0,0.00267854451409767,0.0505,0.0519615242270847,{"$f":"J117","v":0},3.77221545632074]
[null,{"$f":"$D$34","v":1500},0,3.60843918243516,3.86809436020607,0,0.00267854451409767,0.0545,0.109696551146042,{"$f":"J118","v":0},5.29133458475952]
[]
[null,null,null,"RESULTADOS DE LA MEDICIÓN"]
[null,null,null,"Grados Efectivos de Libertad","Factor de Cobertura","U \nExpandida","U \nExpandida","U \nExpandida","U \nExpandida"]
[null,null,null,null,null,null,null,null,null,"Numero de decimales de U","Numero de decimales de % U"]
[null,null,null,null,null,"Uexp","Uexp","Uexp","Uexp"]
[null,null,null,"Veff","k95%",{"$f":"'OPERACIONES PREVIAS'!$D$9","v":"psi"},{"$f":"'OPERACIONES PREVIAS'!$D$9","v":"psi"},"%","%"]
[null,null,null,{"$f":"K114^4/((C114^4/(P23-1))+(E114^4/200)+(D114^4/200)+(F114^4/200)+(G114^4/200)+(H114^4/200)+(I114^4/200)+(J114^4/200))","v":200.063585377572},{"$f":"TINV(100%-95%,D126)","v":1.97189622363391},{"$f":"K114*E126","v":7.11603311197058},{"$f":"IF(F126>10,FIXED(F126,0,0),IF(F126>9.5,FIXED(F126,0,0),IF(ROUND(F126,2)=1,FIXED(F126,1),IF(F126>=1,FIXED(F126,1,0),IF(MID(F126,3,1)<>\"0\",FIXED(F126,2,1),IF(MID(F126,4,1)<>\"0\",FIXED(F126,3,0),IF(MID(F126,5,1)<>\"0\",FIXED(F126,4,0),IF(MID(F126,6,1)<>\"0\",FIXED(F126,5,0),IF(MID(F126,7,1)<>\"0\",FIXED(F126,6,0))))))))))","v":"7,1160"},{"$f":"IF(D138=0,\"----\",(F126/D138)*100)","v":"----"},{"$f":"IF(H126=\"----\",\"----\",IF(H126>10,FIXED(H126,0,0),IF(H126>9.5,FIXED(H126,0,0),IF(ROUND(H126,2)=1,FIXED(H126,1),IF(H126>=1,FIXED(H126,1,0),IF(MID(H126,3,1)<>\"0\",FIXED(H126,2,1),IF(MID(H126,4,1)<>\"0\",FIXED(H126,3,0),IF(MID(H126,5,1)<>\"0\",FIXED(H126,4,0),IF(MID(H126,6,1)<>\"0\",FIXED(H126,5,0),IF(MID(H126,7,1)<>\"0\",FIXED(H126,6,0)))))))))))","v":"----"},{"$f":"LEN(G126)-2","v":4},{"$f":"LEN(I126)-2","v":2}]
[null,null,null,{"$f":"K115^4/((C115^4/(P23-1))+(E115^4/200)+(D115^4/200)+(F115^4/200)+(G115^4/200)+(H115^4/200)+(I115^4/200)+(J115^4/200))","v":203.056008729363},1.97171884846345,{"$f":"K115*E127","v":7.16123158254795},{"$f":"IF(F127>10,FIXED(F127,0,0),IF(F127>9.5,FIXED(F127,0,0),IF(ROUND(F127,2)=1,FIXED(F127,1),IF(F127>=1,FIXED(F127,1,0),IF(MID(F127,3,1)<>\"0\",FIXED(F127,2,1),IF(MID(F127,4,1)<>\"0\",FIXED(F127,3,0),IF(MID(F127,5,1)<>\"0\",FIXED(F127,4,0),IF(MID(F127,6,1)<>\"0\",FIXED(F127,5,0),IF(MID(F127,7,1)<>\"0\",FIXED(F127,6,0))))))))))","v":"7,1612"},{"$f":"(F127/D139)*100","v":2.38707719418265},{"$f":"IF(H127>10,FIXED(H127,0,0),IF(H127>9.5,FIXED(H127,0,0),IF(ROUND(H127,2)=1,FIXED(H127,1),IF(H127>=1,FIXED(H127,1,0),IF(MID(H127,3,1)<>\"0\",FIXED(H127,2,1),IF(MID(H127,4,1)<>\"0\",FIXED(H127,3,0),IF(MID(H127,5,1)<>\"0\",FIXED(H127,4,0),IF(MID(H127,6,1)<>\"0\",FIXED(H127,5,0),IF(MID(H127,7,1)<>\"0\",FIXED(H127,6,0))))))))))","v":"2,3871"},4,4]
[null,null,null,{"$f":"K116^4/((C116^4/(P23-1))+(E116^4/200)+(D116^4/200)+(F116^4/200)+(G116^4/200)+(H116^4/200)+(I116^4/200)+(J116^4/200))","v":220.34220225075},1.9708055923849,7.29045816344213,"7,2905",{"$f":"(F128/D140)*100","v":1.21507636057369},{"$f":"IF(H128>10,FIXED(H128,0,0),IF(H128>9.5,FIXED(H128,0,0),IF(ROUND(H128,2)=1,FIXED(H128,1),IF(H128>=1,FIXED(H128,1,0),IF(MID(H128,3,1)<>\"0\",FIXED(H128,2,1),IF(MID(H128,4,1)<>\"0\",FIXED(H128,3,0),IF(MID(H128,5,1)<>\"0\",FIXED(H128,4,0),IF(MID(H128,6,1)<>\"0\",FIXED(H128,5,0),IF(MID(H128,7,1)<>\"0\",FIXED(H128,6,0))))))))))","v":"1,2151"},4,4]
[null,null,null,{"$f":"K117^4/((C117^4/(P23-1))+(E117^4/200)+(D117^4/200)+(F117^4/200)+(G117^4/200)+(H117^4/200)+(I117^4/200)+(J117^4/200))","v":356.155024014194},1.96664999521195,8.62397299723832,"8,6240",{"$f":"(F129/D141)*100","v":0.958219221915369},{"$f":"IF(H129>10,FIXED(H129,0,0),IF(H129>9.5,FIXED(H129,0,0),IF(ROUND(H129,2)=1,FIXED(H129,1),IF(H129>=1,FIXED(H129,1,0),IF(MID(H129,3,1)<>\"0\",FIXED(H129,2,1),IF(MID(H129,4,1)<>\"0\",FIXED(H129,3,0),IF(MID(H129,5,1)<>\"0\",FIXED(H129,4,0),IF(MID(H129,6,1)<>\"0\",FIXED(H129,5,0),IF(MID(H129,7,1)<>\"0\",FIXED(H129,6,0))))))))))","v":"001"},4,1,null,null,null,"ESTIMACIONES"]
[null,null,null,{"$f":"K118^4/((C118^4/(P23-1))+(E118^4/200)+(D118^4/200)+(F118^4/200)+(G118^4/200)+(H118^4/200)+(I118^4/200)+(J118^4/200))","v":236.834604797219},1.97006685310213,7.43151663325699,"7,4315",{"$f":"(F130/D142)*100","v":0.619293052771416},{"$f":"IF(H130>10,FIXED(H130,0,0),IF(H130>9.5,FIXED(H130,0,0),IF(ROUND(H130,2)=1,FIXED(H130,1),IF(H130>=1,FIXED(H130,1,0),IF(MID(H130,3,1)<>\"0\",FIXED(H130,2,1),IF(MID(H130,4,1)<>\"0\",FIXED(H130,3,0),IF(MID(H130,5,1)<>\"0\",FIXED(H130,4,0),IF(MID(H130,6,1)<>\"0\",FIXED(H130,5,0),IF(MID(H130,7,1)<>\"0\",FIXED(H130,6,0))))))))))","v":"001"},4,1,null,null,"Presión \nNominal","Desviación Estándar","Histéresis","Histéresis \n1ra Serie","Histéresis \n2da Serie","Histéresis \n3ra Serie","Resolución","U \nPatrón","Deriva","Temperatura Patrón","Temperatura IBC","(+) Error Máximo Permitido","(-) Error Máximo Permitido","(+)Límite de aceptación","(-) Límite de aceptación"]
[null,null,null,{"$f":"K119^4/((C119^4/(P23-1))+(E119^4/200)+(D119^4/200)+(F119^4/200)+(G119^4/200)+(H119^4/200)+(I119^4/200)+(J119^4/200))","v":398.517471889577},1.96594232397627,10.4024586104981,"10,402",{"$f":"(F131/D143)*100","v":0.693497240699875},{"$f":"IF(H131>10,FIXED(H131,0,0),IF(H131>9.5,FIXED(H131,0,0),IF(ROUND(H131,2)=1,FIXED(H131,1),IF(H131>=1,FIXED(H131,1,0),IF(MID(H131,3,1)<>\"0\",FIXED(H131,2,1),IF(MID(H131,4,1)<>\"0\",FIXED(H131,3,0),IF(MID(H131,5,1)<>\"0\",FIXED(H131,4,0),IF(MID(H131,6,1)<>\"0\",FIXED(H131,5,0),IF(MID(H131,7,1)<>\"0\",FIXED(H131,6,0))))))))))","v":"001"},4,1]
[]
[null,"Resultados de la Medición en Unidades del IBC",null,null,null,null,"Resultados de la Medición en Unidades del SI",null,null,null,null,null,null,"MPa",{"$f":"'OPERACIONES PREVIAS'!$D$9","v":"psi"},{"$f":"'OPERACIONES PREVIAS'!$D$9","v":"psi"},{"$f":"'OPERACIONES PREVIAS'!$D$9","v":"psi"},{"$f":"'OPERACIONES PREVIAS'!$D$9","v":"psi"},{"$f":"'OPERACIONES PREVIAS'!$D$9","v":"psi"},{"$f":"'OPERACIONES PREVIAS'!$D$9","v":"psi"},{"$f":"'OPERACIONES PREVIAS'!$D$9","v":"psi"},{"$f":"'OPERACIONES PREVIAS'!$D$9","v":"psi"},{"$f":"'OPERACIONES PREVIAS'!$D$9","v":"psi"},{"$f":"'OPERACIONES PREVIAS'!$D$9","v":"psi"},{"$f":"'OPERACIONES PREVIAS'!$D$9","v":"psi"},{"$f":"'OPERACIONES PREVIAS'!$D$9","v":"psi"},{"$f":"'OPERACIONES PREVIAS'!$D$9","v":"psi"},{"$f":"'OPERACIONES PREVIAS'!$D$9","v":"psi"}]
[null,"Presión \nNominal","Lectura \nPatrón","Lectura \nIBC","Corrección Final de Calibración","U \nExpandida\nk=2","Presión \nNominal","Lectura \nPatrón","Lectura \nIBC","Corrección final de calibración","U \nExpandida\nk=2",null,null,{"$f":"$D$29","v":0},{"$f":"IF('OPERACIONES PREVIAS'!$K$8>=0.25,_xlfn.STDEV.S(K29,K42),_xlfn.STDEV.S(K29,K42,K55))","v":0},{"$f":"IF('OPERACIONES PREVIAS'!$K$8>=0.25,MAX(Q134:R134),MAX(Q134:S134))","v":0},{"$f":"ABS(K29-K40)","v":0},{"$f":"ABS(K42-K53)","v":0},{"$f":"IF('OPERACIONES PREVIAS'!$K$8<0.25,ABS(K55-K66),\"----\")","v":"----"},{"$f":"'OPERACIONES PREVIAS'!$K$7","v":12.5},{"$f":"Q29","v":0.084},{"$f":"S29","v":0.0300000000000114},{"$f":"((D18*D10)/100)*J72","v":0},{"$f":"(('OPERACIONES PREVIAS'!F9*'OPERACIONES PREVIAS'!L5)/100)*J72","v":0},{"$f":"IF('OPERACIONES PREVIAS'!$L$8=\"Del rango\",('OPERACIONES PREVIAS'!$K$8/100)*'OPERACIONES PREVIAS'!$L$4,IF('OPERACIONES PREVIAS'!$L$8=\"De lectura\",B114*('OPERACIONES PREVIAS'!$K$8/100)))","v":24},{"$f":"-Y134","v":-24},{"$f":"IF('OPERACIONES PREVIAS'!$D$16=\"SI\",SQRT((Y134^2)-($F126)),REGISTRO!Y134)","v":24},{"$f":"IF('OPERACIONES PREVIAS'!$D$16=\"SI\",-SQRT((Z134^2)-(G126)),Z134)","v":-24}]
[null,null,null,null,null,null,null,null,null,null,null,null,null,{"$f":"$D$30","v":300},{"$f":"IF('OPERACIONES PREVIAS'!$K$8>=0.25,_xlfn.STDEV.S(K30,K43),_xlfn.STDEV.S(K30,K43,K56))","v":0.70671330553982},{"$f":"IF('OPERACIONES PREVIAS'!$K$8>=0.25,MAX(Q135:R135),MAX(Q135:S135))","v":0.099944461027178},{"$f":"ABS(K30-K39)","v":0.099944461027178},{"$f":"ABS(K43-K52)","v":0.099944266614898},{"$f":"IF('OPERACIONES PREVIAS'!$K$8<0.25,ABS(K56-K65),\"----\")","v":"----"},{"$f":"'OPERACIONES PREVIAS'!$K$7","v":12.5},0.086,0.109999999999977,{"$f":"W134","v":0},0,{"$f":"IF('OPERACIONES PREVIAS'!$L$8=\"Del rango\",('OPERACIONES PREVIAS'!$K$8/100)*'OPERACIONES PREVIAS'!$L$4,IF('OPERACIONES PREVIAS'!$L$8=\"De lectura\",B115*('OPERACIONES PREVIAS'!$K$8/100)))","v":24},-24,{"$f":"IF('OPERACIONES PREVIAS'!$D$16=\"SI\",SQRT((Y135^2)-($F127)),REGISTRO!Y135)","v":24},{"$f":"IF('OPERACIONES PREVIAS'!$D$16=\"SI\",-SQRT((Z135^2)-(G127)),Z135)","v":-24}]
[null,null,null,null,null,null,null,null,null,null,null,null,null,{"$f":"$D$31","v":600},{"$f":"IF('OPERACIONES PREVIAS'!$K$8>=0.25,_xlfn.STDEV.S(K31,K44),_xlfn.STDEV.S(K31,K44,K57))","v":0.141398609317162},{"$f":"IF('OPERACIONES PREVIAS'!$K$8>=0.25,MAX(Q136:R136),MAX(Q136:S136))","v":2.79954670286736},{"$f":"ABS(K31-K38)","v":2.79954670286736},{"$f":"ABS(K44-K51)","v":1.99967653969998},{"$f":"IF('OPERACIONES PREVIAS'!$K$8<0.25,ABS(K57-K64),\"----\")","v":"----"},{"$f":"'OPERACIONES PREVIAS'!$K$7","v":12.5},0.09,0.130000000000073,0,0,{"$f":"IF('OPERACIONES PREVIAS'!$L$8=\"Del rango\",('OPERACIONES PREVIAS'!$K$8/100)*'OPERACIONES PREVIAS'!$L$4,IF('OPERACIONES PREVIAS'!$L$8=\"De lectura\",B116*('OPERACIONES PREVIAS'!$K$8/100)))","v":24},-24,{"$f":"IF('OPERACIONES PREVIAS'!$D$16=\"SI\",SQRT((Y136^2)-($F128)),REGISTRO!Y136)","v":24},{"$f":"IF('OPERACIONES PREVIAS'!$D$16=\"SI\",-SQRT((Z136^2)-(G128)),Z136)","v":-24}]
[null,{"$f":"'OPERACIONES PREVIAS'!$D$9","v":"psi"},{"$f":"'OPERACIONES PREVIAS'!$D$9","v":"psi"},{"$f":"'OPERACIONES PREVIAS'!$D$9","v":"psi"},{"$f":"'OPERACIONES PREVIAS'!$D$9","v":"psi"},{"$f":"'OPERACIONES PREVIAS'!$D$9","v":"psi"},{"$f":"$P$21","v":"kPa"},{"$f":"$P$21","v":"kPa"},{"$f":"$P$21","v":"kPa"},{"$f":"$P$21","v":"kPa"},{"$f":"$P$21","v":"kPa"},null,null,{"$f":"$D$32","v":900},{"$f":"IF('OPERACIONES PREVIAS'!$K$8>=0.25,_xlfn.STDEV.S(K32,K45),_xlfn.STDEV.S(K32,K45,K58))","v":0.353544463487803},{"$f":"IF('OPERACIONES PREVIAS'!$K$8>=0.25,MAX(Q137:R137),MAX(Q137:S137))","v":8.59977567208784},{"$f":"ABS(K32-K37)","v":8.59977567208784},{"$f":"ABS(K45-K50)","v":8.29978449951591},{"$f":"IF('OPERACIONES PREVIAS'!$K$8<0.25,ABS(K58-K63),\"----\")","v":"----"},{"$f":"'OPERACIONES PREVIAS'!$K$7","v":12.5},0.09,0.130000000000073,0,0,{"$f":"IF('OPERACIONES PREVIAS'!$L$8=\"Del rango\",('OPERACIONES PREVIAS'!$K$8/100)*'OPERACIONES PREVIAS'!$L$4,IF('OPERACIONES PREVIAS'!$L$8=\"De lectura\",B117*('OPERACIONES PREVIAS'!$K$8/100)))","v":24},-24,{"$f":"IF('OPERACIONES PREVIAS'!$D$16=\"SI\",SQRT((Y137^2)-($F129)),REGISTRO!Y137)","v":24},{"$f":"IF('OPERACIONES PREVIAS'!$D$16=\"SI\",-SQRT((Z137^2)-(G129)),Z137)","v":-24}]
[null,{"$f":"$D$29","v":0},{"$f":"IF('OPERACIONES PREVIAS'!$K$8>=0.24,AVERAGE(I29,I40,I42,I53),AVERAGE(I29,I40,I42,I53,I55,I66))","v":0.2249},{"$f":"IF('OPERACIONES PREVIAS'!$K$8>=0.24,AVERAGE(J29,J40,J42,J53),AVERAGE(J29,J40,J42,J53,J55,J66))","v":0},{"$f":"C138-D138+($I$14)","v":0.317225025289481},{"$f":"F126","v":7.11603311197058},{"$f":"B138*F.C","v":0},{"$f":"C138*F.C","v":1.550631524},0,{"$f":"E138*F.C","v":2.1871904153649},{"$f":"IF((F138*F.C)>10,FIXED((F138*F.C),0,0),IF((F138*F.C)>9.5,FIXED((F138*F.C),0,0),IF(ROUND((F138*F.C),2)=1,FIXED((F138*F.C),1),IF((F138*F.C)>=1,FIXED((F138*F.C),1,0),IF(MID((F138*F.C),3,1)<>\"0\",FIXED((F138*F.C),2,1),IF(MID((F138*F.C),4,1)<>\"0\",FIXED((F138*F.C),3,0),IF(MID((F138*F.C),5,1)<>\"0\",FIXED((F138*F.C),4,0),IF(MID((F138*F.C),6,1)<>\"0\",FIXED((F138*F.C),5,0),IF(MID((F138*F.C),7,1)<>\"0\",FIXED((F138*F.C),6,0))))))))))","v":"49,063"},null,null,{"$f":"$D$33","v":1200},{"$f":"IF('OPERACIONES PREVIAS'!$K$8>=0.25,_xlfn.STDEV.S(K33,K46),_xlfn.STDEV.S(K33,K46,K59))","v":0},{"$f":"IF('OPERACIONES PREVIAS'!$K$8>=0.25,MAX(Q138:R138),MAX(Q138:S138))","v":3.79993958976843},{"$f":"ABS(K33-K36)","v":3.79993958976843},{"$f":"ABS(K46-K49)","v":3.4999443249601},{"$f":"IF('OPERACIONES PREVIAS'!$K$8<0.25,ABS(K59-K62),\"----\")","v":"----"},{"$f":"'OPERACIONES PREVIAS'!$K$7","v":12.5},0.101,0.180000000000064,0,0,{"$f":"IF('OPERACIONES PREVIAS'!$L$8=\"Del rango\",('OPERACIONES PREVIAS'!$K$8/100)*'OPERACIONES PREVIAS'!$L$4,IF('OPERACIONES PREVIAS'!$L$8=\"De lectura\",B118*('OPERACIONES PREVIAS'!$K$8/100)))","v":24},-24,{"$f":"IF('OPERACIONES PREVIAS'!$D$16=\"SI\",SQRT((Y138^2)-($F130)),REGISTRO!Y138)","v":24},{"$f":"IF('OPERACIONES PREVIAS'!$D$16=\"SI\",-SQRT((Z138^2)-(G130)),Z138)","v":-24}]
[null,{"$f":"$D$30","v":300},{"$f":"IF('OPERACIONES PREVIAS'!$K$8>=0.24,AVERAGE(I30,I39,I43,I52),AVERAGE(I30,I39,I43,I52,I56,I65))","v":301.893377822183},{"$f":"IF('OPERACIONES PREVIAS'!$K$8>=0.24,AVERAGE(J30,J39,J43,J52),AVERAGE(J30,J39,J43,J52,J56,J65))","v":300},{"$f":"C139-D139+($I$14)","v":1.98570284747279},{"$f":"F127","v":7.16123158254795},2068.428,2081.48238567328,2068.428,13.6909445646415,"49,375",null,null,{"$f":"$D$34","v":1500},{"$f":"IF('OPERACIONES PREVIAS'!$K$8>=0.25,_xlfn.STDEV.S(K34,K47),_xlfn.STDEV.S(K34,K47,K60))","v":0},{"$f":"IF('OPERACIONES PREVIAS'!$K$8>=0.25,MAX(Q139:R139),MAX(Q139:S139))","v":13.3994719206951},{"$f":"ABS(K34-K35)","v":13.0994838784402},{"$f":"ABS(K47-K48)","v":13.3994719206951},{"$f":"IF('OPERACIONES PREVIAS'!$K$8<0.25,ABS(K60-K61),\"----\")","v":"----"},{"$f":"'OPERACIONES PREVIAS'!$K$7","v":12.5},0.109,0.380000000000045,0,0,{"$f":"IF('OPERACIONES PREVIAS'!$L$8=\"Del rango\",('OPERACIONES PREVIAS'!$K$8/100)*'OPERACIONES PREVIAS'!$L$4,IF('OPERACIONES PREVIAS'!$L$8=\"De lectura\",B119*('OPERACIONES PREVIAS'!$K$8/100)))","v":24},-24,{"$f":"IF('OPERACIONES PREVIAS'!$D$16=\"SI\",SQRT((Y139^2)-($F131)),REGISTRO!Y139)","v":24},{"$f":"IF('OPERACIONES PREVIAS'!$D$16=\"SI\",-SQRT((Z139^2)-(G131)),Z139)","v":-24}]
[null,{"$f":"$D$31","v":600},{"$f":"IF('OPERACIONES PREVIAS'!$K$8>=0.24,AVERAGE(I31,I38,I44,I51),AVERAGE(I31,I38,I44,I51,I57,I64))","v":599.244941807384},{"$f":"IF('OPERACIONES PREVIAS'!$K$8>=0.24,AVERAGE(J31,J38,J44,J51),AVERAGE(J31,J38,J44,J51,J57,J64))","v":600},-0.662733167326339,7.29045816344213,4136.856,4131.65005497588,4136.856,-4.56938613275495,"50,266"]
[11,{"$f":"$D$32","v":900},{"$f":"IF('OPERACIONES PREVIAS'!$K$8>=0.24,AVERAGE(I32,I37,I45,I50),AVERAGE(I32,I37,I45,I50,I58,I63))","v":895.146665148803},{"$f":"IF('OPERACIONES PREVIAS'!$K$8>=0.24,AVERAGE(J32,J37,J45,J50),AVERAGE(J32,J37,J45,J50,J58,J63))","v":900},-4.76100982590754,8.62397299723832,6205.284,6171.82142100136,6205.284,-32.8260201072743,"59,460",null,"Número de decimales de U","Evaluación del teorema del límite central"]
[null,{"$f":"$D$33","v":1200},{"$f":"IF('OPERACIONES PREVIAS'!$K$8>=0.24,AVERAGE(I33,I36,I46,I49),AVERAGE(I33,I36,I46,I49,I59,I62))","v":1200.99218415036},{"$f":"IF('OPERACIONES PREVIAS'!$K$8>=0.24,AVERAGE(J33,J36,J46,J49),AVERAGE(J33,J36,J46,J49,J59,J62))","v":1200},1.08450917565346,7.43151663325699,8273.712,8280.55287159256,8273.712,7.47743048392848,"51,239",null,null,"Normal","Rectangular","Rectangular","Rectangular","Normal","Normal","Rectangular","Rectangular"]
[null,{"$f":"$D$34","v":1500},{"$f":"IF('OPERACIONES PREVIAS'!$K$8>=0.24,AVERAGE(I34,I35,I47,I48),AVERAGE(I34,I35,I47,I48,I60,I61))","v":1492.5341347847},{"$f":"IF('OPERACIONES PREVIAS'!$K$8>=0.24,AVERAGE(J34,J35,J47,J48),AVERAGE(J34,J35,J47,J48,J60,J61))","v":1500},-7.373540190011,10.4024586104981,10342.14,10290.6646511482,{"$f":"D143*F.C","v":10342.14},-50.8387899604802,"71,722",null,null,"u\nRepetibilidad","u\nHistéresis","u\nResolución","u\nTemp IBC","u Nivel de referencia","u\nCal Patrón","u\nDeriva Patrón","u\nTemp Patrón"]
[]
[null,null,null,null,null,null,null,null,null,null,null,null,{"$f":"LEN(K138)-2","v":4},"u(σ)","u(δHis)","u(δRes)","u(δTem)","u(ΔNR)","u(δCal)","u(δDer)","u(δTem)","u\nMáxima",null,"Tipo de distribución","Evaluador","Es"]
[null,null,null,null,null,null,null,null,null,null,null,null,4,{"$f":"'OPERACIONES PREVIAS'!$D$9","v":"psi"},{"$f":"'OPERACIONES PREVIAS'!$D$9","v":"psi"},{"$f":"'OPERACIONES PREVIAS'!$D$9","v":"psi"},{"$f":"'OPERACIONES PREVIAS'!$D$9","v":"psi"},{"$f":"'OPERACIONES PREVIAS'!$D$9","v":"psi"},{"$f":"'OPERACIONES PREVIAS'!$D$9","v":"psi"},{"$f":"'OPERACIONES PREVIAS'!$D$9","v":"psi"},{"$f":"'OPERACIONES PREVIAS'!$D$9","v":"psi"},null,null,null,null,"Dominante"]
[null,null,null,null,null,null,null,null,null,null,null,null,4,{"$f":"C114","v":0},{"$f":"E114","v":0},{"$f":"D114","v":3.60843918243516},{"$f":"F114","v":0},0.00267854451409767,0.042,0.00866025403784767,0,{"$f":"MAX(N147:U147)","v":3.60843918243516},{"$f":"INDEX($N$145:$U$147,1,MATCH(V147,N147:U147,0))","v":"u(δRes)"},{"$f":"INDEX($N$142:$U$147,1,MATCH(V147,N147:U147,0))","v":"Rectangular"},{"$f":"SQRT(SUMSQ(N147:U147)-V147^2)/V147","v":0.0119074014518238},{"$f":"IF(Y147<=0.3,\"Si\",\"No\")","v":"Si"}]
[null,null,null,null,null,null,null,null,null,null,null,null,4,0.408021117193305,0.0288514807390266,3.60843918243516,0,0.00267854451409767,0.043,0.0317542648054229,0,3.60843918243516,"u(δRes)","Rectangular",0.114322708866623,"Si"]
[null,null,null,null,null,null,null,null,null,null,null,null,4,0.0816365251523021,0.8081595212547,3.60843918243516,0,0.00267854451409767,0.045,0.0375277674973467,0,3.60843918243516,"u(δRes)","Rectangular",0.225689657412813,"Si"]
[null,null,null,null,null,null,null,null,null,null,null,null,4,0.204118991165185,2.48254139962516,3.60843918243516,0,0.00267854451409767,0.045,0.0375277674973467,0,3.60843918243516,"u(δRes)","Rectangular",0.690495022226085,"No"]
[null,null,null,null,null,null,null,null,null,null,null,null,null,0,1.09694807252856,3.60843918243516,0,0.00267854451409767,0.0505,0.0519615242270847,0,3.60843918243516,"u(δRes)","Rectangular",0.30465854965687,"No"]
[null,null,null,null,null,null,null,null,null,null,null,null,null,0,3.86809436020607,3.60843918243516,0,0.00267854451409767,0.0545,0.109696551146042,0,3.86809436020607,"u(δHis)","Rectangular",0.933410149478505,"No"]
[]
[]
[]
[]
[]
[]
[]
[]
[null,null,"Calibró","MICHAEL VALERO",null,null,"Cargo",{"$f":"VLOOKUP(D161,F169:H172,2,0)","v":"ESPECIALISTA TÉCNICO"}]
[]
[]
[]
[]
[]
[]
[]
[null,null,null,null,null,"MICHAEL VALERO","ESPECIALISTA TÉCNICO"]
[null,null,null,null,null,null,"ESPECIALISTA TÉCNICO"]
[null,null,null,null,null,null,"ESPECIALISTA TÉCNICO"]

{"sheet":"CERTIFICADO","index":2,"n_rows":58,"n_cols":37,"rows_kept":58,"cut":false,"hidden":false,"merged":[[7,0,7,6],[7,8,7,16],[7,18,7,26],[7,28,7,36],[8,0,8,6],[8,8,8,16],[8,18,8,26],[8,28,8,36],[9,0,9,6],[9,8,9,16],[9,18,9,26],[9,28,9,36],[12,5,12,6],[12,15,12,16],[12,24,12,26],[12,34,12,36],[14,3,14,6],[15,18,15,20],[15,21,15,23],[15,24,15,26],[18,3,18,6],[20,3,20,6],[22,3,22,6],[22,8,22,16],[23,10,23,12],[23,14,23,16],[24,3,24,6],[24,10,24,12],[24,14,24,16],[25,10,25,12],[25,13,25,14],[25,15,25,16],[26,10,26,12],[27,8,27,16],[28,10,28,12],[28,14,28,16],[29,10,29,12],[29,14,29,16],[30,10,30,12],[30,15,30,16],[31,10,31,12],[32,3,32,6],[32,8,32,16],[33,10,33,12],[33,14,33,16],[34,3,34,6],[34,10,34,12],[34,14,34,16],[35,10,35,12],[36,10,36,12],[37,8,37,16],[38,10,38,12],[38,14,38,16],[39,10,39,12],[39,14,39,16],[40,0,40,1],[40,10,40,12],[41,10,41,12],[42,8,42,16],[43,8,43,16],[44,1,44,4],[44,8,44,9],[44,10,44,15],[45,2,45,3],[45,8,45,9],[45,10,45,12],[45,14,45,16],[46,8,46,9],[46,10,46,12],[46,14,46,16],[47,10,47,12],[49,28,49,29],[49,30,49,34],[50,8,50,16],[53,28,53,36],[56,0,56,6],[56,8,56,16],[56,18,56,26],[56,28,56,36],[57,0,57,6],[57,8,57,16],[57,18,57,26],[57,28,57,36],[28,19,29,19],[38,19,39,19],[28,20,29,20],[38,20,39,20],[28,23,29,23],[38,23,39,23],[28,21,29,22],[35,15,36,16],[28,24,29,25],[47,0,54,6],[50,28,52,36],[37,28,48,36],[26,3,27,6],[28,3,29,6],[38,24,39,25],[22,18,24,26],[15,8,19,16],[126,25,127,26],[53,8,54,16],[38,21,39,22]]}
[]
[]
[]
[]
[]
[]
[]
["CERTIFICADO DE CALIBRACIÓN",null,null,null,null,null,null,null,{"$f":"$A$8","v":"CERTIFICADO DE CALIBRACIÓN"},null,null,null,null,null,null,null,null,null,{"$f":"$A$8","v":"CERTIFICADO DE CALIBRACIÓN"},null,null,null,null,null,null,null,null,null,{"$f":"$A$8","v":"CERTIFICADO DE CALIBRACIÓN"}]
["CERTIFICATE OF CALIBRATION",null,null,null,null,null,null,null,{"$f":"$A$9","v":"CERTIFICATE OF CALIBRATION"},null,null,null,null,null,null,null,null,null,{"$f":"$A$9","v":"CERTIFICATE OF CALIBRATION"},null,null,null,null,null,null,null,null,null,{"$f":"$A$9","v":"CERTIFICATE OF CALIBRATION"}]
["DID-159 / VERSIÓN: 08 / REVISIÓN: 2020-06-05 ",null,null,null,null,null,null,null,{"$f":"A10","v":"DID-159 / VERSIÓN: 08 / REVISIÓN: 2020-06-05 "},null,null,null,null,null,null,null,null,null,{"$f":"A10","v":"DID-159 / VERSIÓN: 08 / REVISIÓN: 2020-06-05 "},null,null,null,null,null,null,null,null,null,{"$f":"A10","v":"DID-159 / VERSIÓN: 08 / REVISIÓN: 2020-06-05 "}]
[null,null,null,null,null,"Número:",{"$f":"'OPERACIONES PREVIAS'!K2","v":"DID-159-3123"},null,null,null,null,null,null,null,null,{"$f":"$F$11","v":"Número:"},{"$f":"G11","v":"DID-159-3123"},null,null,null,null,null,null,null,null,{"$f":"$F$11","v":"Número:"},{"$f":"G11","v":"DID-159-3123"},null,null,null,null,null,null,null,null,{"$f":"$F$11","v":"Número:"},{"$f":"G11","v":"DID-159-3123"}]
["LABORATORIO DE CALIBRACIÓN",null,null,null,null,null,null,null,{"$f":"$A$12","v":"LABORATORIO DE CALIBRACIÓN"},null,null,null,null,null,null,null,null,null,{"$f":"$A$12","v":"LABORATORIO DE CALIBRACIÓN"},null,null,null,null,null,null,null,null,null,{"$f":"$A$12","v":"LABORATORIO DE CALIBRACIÓN"}]
["PRESIÓN",null,null,null,null,"Página 1 de 4",null,null,{"$f":"$A$13","v":"PRESIÓN"},null,null,null,null,null,null,{"$f":"IF(F13=\"Página 1 de 2\",\"Página 2 de 2\",IF(F13=\"Página 1 de 3\",\"Página 2 de 3\",IF(F13=\"Página 1 de 4\",\"Página 2 de 4\",IF(F13=\"Página 1 de 5\",\"Página 2 de 5\",IF(F13=\"Página 1 de 6\",\"Página 2 de 6\",FALSE)))))","v":"Página 2 de 4"},null,null,{"$f":"$A$13","v":"PRESIÓN"},null,null,null,null,null,{"$f":"IF(F13=\"Página 1 de 3\",\"Página 3 de 3\",IF(F13=\"Página 1 de 4\",\"Página 3 de 4\",IF(F13=\"Página 1 de 5\",\"Página 3 de 5\",IF(F13=\"Página 1 de 6\",\"Página 3 de 6\",FALSE))))","v":"Página 3 de 4"},null,null,null,{"$f":"$A$13","v":"PRESIÓN"},null,null,null,null,null,{"$f":"IF(F13=\"Página 1 de 3\",\"Página 3 de 3\",IF(F13=\"Página 1 de 4\",\"Página 4 de 4\",IF(F13=\"Página 1 de 5\",\"Página 4 de 5\",IF(F13=\"Página 1 de 6\",\"Página 4 de 6\",FALSE))))","v":"Página 4 de 4"}]
[]
["INSTRUMENTO:",null,null,{"$f":"'OPERACIONES PREVIAS'!D5&\" \"&'OPERACIONES PREVIAS'!G5","v":"MANÓMETRO ANALÓGICO"},null,null,null,null,"TRAZABILIDAD:",null,null,null,null,null,null,null,null,null,"CONDICIONES AMBIENTALES DURANTE LA CALIBRACIÓN:",null,null,null,null,null,null,null,null,null,"DATOS OBTENIDOS DURANTE LA CALIBRACIÓN: "]
["INSTRUMENT",null,null,null,null,null,null,null,"CALIBRATION SERVICE S.A.S. garantiza que sus resultados de medición mantienen la trazabilidad metrológica de acuerdo con las directrices del documento ILAC-P10:01/2013: ILAC “Policy on traceability of measurements results”, y los establecidos en ISO/IEC 17025: 2017.",null,null,null,null,null,null,null,null,null,"MÁXIMA",null,null,"MÍNIMA",null,null,"VARIACIÓN MÁXIMA"]
["FABRICANTE:",null,null,{"$f":"'OPERACIONES PREVIAS'!D6","v":"STEWARTS-USA"},null,null,null,null,null,null,null,null,null,null,null,null,null,null,"Temperatura:",null,{"$f":"REGISTRO!C73","v":21.8},"Temperatura:",null,{"$f":"REGISTRO!C72","v":21.6},"Temperatura:",null,{"$f":"U17-X17","v":0.199999999999999}]
["MANUFACTURER",null,null,null,null,null,null,null,null,null,null,null,null,null,null,null,null,null,"Humedad relativa:",null,{"$f":"REGISTRO!E73","v":61.8},"Humedad relativa:",null,{"$f":"REGISTRO!E72","v":61.5},"Humedad relativa:",null,{"$f":"U18-X18","v":0.299999999999997}]
["MODELO:",null,null,{"$f":"'OPERACIONES PREVIAS'!D7","v":"NO IDENTIFICABLE"},null,null,null,null,null,null,null,null,null,null,null,null,null,null,"Presión atmosférica:",null,{"$f":"REGISTRO!G73","v":749.5},"Presión atmosférica:",null,{"$f":"REGISTRO!G72","v":749.2},"Presión atmosférica:",null,{"$f":"U19-X19","v":0.299999999999955}]
["MODEL"]
["NÚMERO DE SERIE:",null,null,{"$f":"'OPERACIONES PREVIAS'!D8","v":"CR-1419"}]
["SERIAL NUMBER",null,null,null,null,null,null,null,"INFORMACIÓN DE LOS INSTRUMENTOS:",null,null,null,null,null,null,null,null,null,"INCERTIDUMBRE DE MEDICIÓN:"]
["INTERVALO DE MEDICIÓN:",null,null,{"$f":"'OPERACIONES PREVIAS'!K4&\" \"&'OPERACIONES PREVIAS'!D9&\" a \"&'OPERACIONES PREVIAS'!L4&\" \"&'OPERACIONES PREVIAS'!D9","v":"0 psi a 1500 psi"},null,null,null,null,"INSTRUMENTOS PATRÓN EMPLEADOS EN LA CALIBRACIÓN",null,null,null,null,null,null,null,null,null,"La incertidumbre expandida de la medición reportada se establece como la incertidumbre estándar de medición multiplicada por el factor de cobertura “k” y la probabilidad de cobertura, la cual debe ser aproximada al 95% y no menor a este valor."]
["MEASUREMENT RANGE",null,null,null,null,null,null,null,"Instrumento:",null,{"$f":"REGISTRO!D7","v":"MANÓMETRO DIGITAL"},null,null,"Marca:",{"$f":"REGISTRO!D8","v":"ADDITEL"}]
["INTERVALO DE CALIBRACIÓN:",null,null,{"$f":"'OPERACIONES PREVIAS'!K5&\" \"&'OPERACIONES PREVIAS'!D9&\" a \"&'OPERACIONES PREVIAS'!L5&\" \"&'OPERACIONES PREVIAS'!D9","v":"0 psi a 1500 psi"},null,null,null,null,"Serie:",null,{"$f":"REGISTRO!D14","v":"CS-MP-010 / 27312320013"},null,null,"Modelo:",{"$f":"REGISTRO!D9","v":"ADT672"}]
["CALIBRATION RANGE",null,null,null,null,null,null,null,"Certificado No:",null,{"$f":"REGISTRO!D11","v":"LPR181275a"},null,null,"Intervalo de medición:",null,{"$f":"CONCATENATE(\" 0 psi  a \",,REGISTRO!D10,\" psi\")","v":" 0 psi  a 3000 psi"}]
["SOLICITANTE:",null,null,{"$f":"'OPERACIONES PREVIAS'!C2","v":"SCHLUMBERGER SURENCO S A"},null,null,null,null,"Fecha de calibración:",null,{"$f":"REGISTRO!D12","v":"2018-10-12"},null,null,null,null,null,null,null,"DATOS OBTENIDOS DURANTE LA CALIBRACIÓN: "]
["CUSTOMER"]
["DIRECCIÓN:",null,null,{"$f":"'OPERACIONES PREVIAS'!C3","v":"KILOMETRO 1.5 VIA SIBERIA COTA PARQUE INDUSTRIAL POTRERO CHICO, COTA"},null,null,null,null,"Instrumento:",null,{"$f":"'CORRECCIÓN EQUIPOS AUX'!M21","v":"BARÓMETRO"},null,null,"Marca:",{"$f":"'CORRECCIÓN EQUIPOS AUX'!Q21","v":"EXTECH"},null,null,null,null,"Lectura promedio \nPatrón","Lectura promedio\nIBC","Corrección promedio de calibración",null,"Factor de cobertura","Incertidumbre \nExpandida"]
["ADDRESS",null,null,null,null,null,null,null,"Serie:",null,{"$f":"'CORRECCIÓN EQUIPOS AUX'!M22","v":"A.078181"},null,null,"Modelo:",{"$f":"'CORRECCIÓN EQUIPOS AUX'!Q22","v":"SD700"}]
["FECHA DE RECEPCIÓN:",null,null,{"$f":"'OPERACIONES PREVIAS'!D11","v":"2020-12-14"},null,null,null,null,"Certificado No:",null,{"$f":"'CORRECCIÓN EQUIPOS AUX'!M23","v":"CERT-18-EMP-1991-3357"},null,null,"Intervalo de medición:",null,{"$f":"'CORRECCIÓN EQUIPOS AUX'!Q23","v":"500 hPa a 1100 hPa"},null,null,null,{"$f":"'OPERACIONES PREVIAS'!D9","v":"psi"},{"$f":"'OPERACIONES PREVIAS'!D9","v":"psi"},{"$f":"'OPERACIONES PREVIAS'!D9","v":"psi"},"%L","k",{"$f":"'OPERACIONES PREVIAS'!D9","v":"psi"},"% Lec."]
["DATE OF RECEPTION",null,null,null,null,null,null,null,"Fecha de calibración:",null,{"$f":"'CORRECCIÓN EQUIPOS AUX'!M24","v":"2018-12-11"},null,null,null,null,null,null,null,null,{"$f":"REGISTRO!C138","v":0.2249},{"$f":"REGISTRO!D138","v":0},{"$f":"FIXED(REGISTRO!E138,REGISTRO!J126)","v":",3172250"},0,{"$f":"IF(W32=\"----\",\"----\",REGISTRO!E126)","v":1.97189622363391},{"$f":"IF(X32=\"----\",\"----\",REGISTRO!G126)","v":"7,1160"},0,{"$f":"IF('OPERACIONES PREVIAS'!$D$16=\"SI\",IFERROR(IF(SUM(V32+Y32)>REGISTRO!AA134,\"NO CONFORME\",\"CONFORME\"),\"\"),\"\")","v":""}]
["FECHA DE CALIBRACIÓN:",null,null,{"$f":"'OPERACIONES PREVIAS'!D12","v":"2020-12-23"},null,null,null,null,null,null,null,null,null,null,null,null,null,null,null,{"$f":"REGISTRO!C139","v":301.893377822183},{"$f":"REGISTRO!D139","v":300},{"$f":"FIXED(REGISTRO!E139,REGISTRO!J127)","v":"1,9857028"},{"$f":"(V33/U33)*100","v":0.661900933333333},{"$f":"REGISTRO!E127","v":1.97171884846345},{"$f":"REGISTRO!G127","v":"7,1612"},{"$f":"REGISTRO!I127","v":"2,3871"},{"$f":"IF('OPERACIONES PREVIAS'!$D$16=\"SI\",IFERROR(IF(SUM(V33+Y33)>REGISTRO!AA135,\"NO CONFORME\",\"CONFORME\"),\"\"),\"\")","v":""}]
["DATE OF CALIBRATION",null,null,null,null,null,null,null,"Instrumento:",null,{"$f":"IF(REGISTRO!E4=LISTAS!A17,'CORRECCIÓN EQUIPOS AUX'!C2,'CORRECCIÓN EQUIPOS AUX'!C21)","v":"TERMOHIGRÓMETRO DIGITAL"},null,null,"Marca:",{"$f":"IF(REGISTRO!$E$4=LISTAS!$A$17,'CORRECCIÓN EQUIPOS AUX'!G2,'CORRECCIÓN EQUIPOS AUX'!G21)","v":"T&D CORPORATION"},null,null,null,null,{"$f":"REGISTRO!C140","v":599.244941807384},{"$f":"REGISTRO!D140","v":600},{"$f":"FIXED(REGISTRO!E140,REGISTRO!J128)","v":"-,6627332"},{"$f":"(V34/U34)*100","v":-0.110455533333333},{"$f":"REGISTRO!E128","v":1.9708055923849},{"$f":"REGISTRO!G128","v":"7,2905"},{"$f":"REGISTRO!I128","v":"1,2151"},{"$f":"IF('OPERACIONES PREVIAS'!$D$16=\"SI\",IFERROR(IF(SUM(V34+Y34)>REGISTRO!AA136,\"NO CONFORME\",\"CONFORME\"),\"\"),\"\")","v":""}]
["FECHA DE EXPEDICIÓN:",null,null,{"$f":"IF('OPERACIONES PREVIAS'!K11=\"\",\"\",'OPERACIONES PREVIAS'!K11)","v":"2020-12-23"},null,null,null,null,"Serie:",null,{"$f":"IF(REGISTRO!E4=LISTAS!A17,'CORRECCIÓN EQUIPOS AUX'!C3,'CORRECCIÓN EQUIPOS AUX'!C22)","v":"F80629AA"},null,null,"Modelo:",{"$f":"IF(REGISTRO!$E$4=LISTAS!$A$17,'CORRECCIÓN EQUIPOS AUX'!G3,'CORRECCIÓN EQUIPOS AUX'!G22)","v":"TR-73U"},null,null,null,null,{"$f":"REGISTRO!C141","v":895.146665148803},{"$f":"REGISTRO!D141","v":900},{"$f":"FIXED(REGISTRO!E141,REGISTRO!J129)","v":"-4,7610098"},{"$f":"(V35/U35)*100","v":-0.529001088888889},{"$f":"REGISTRO!E129","v":1.96664999521195},{"$f":"REGISTRO!G129","v":"8,6240"},{"$f":"REGISTRO!I129","v":"001"},{"$f":"IF('OPERACIONES PREVIAS'!$D$16=\"SI\",IFERROR(IF(SUM(V35+Y35)>REGISTRO!AA137,\"NO CONFORME\",\"CONFORME\"),\"\"),\"\")","v":""}]
["DATE OF ISSUE",null,null,null,null,null,null,null,"Certificado No:",null,{"$f":"IF(REGISTRO!E4=LISTAS!A17,'CORRECCIÓN EQUIPOS AUX'!C4,'CORRECCIÓN EQUIPOS AUX'!C23)","v":"C4502-20 "},null,null,"Intervalo de medición:",null,{"$f":"IF(REGISTRO!$E$4=LISTAS!$A$17,'CORRECCIÓN EQUIPOS AUX'!G4,'CORRECCIÓN EQUIPOS AUX'!G23)","v":"18°C a 28 °C / 30 %HR a 70%HR"},null,null,null,{"$f":"REGISTRO!C142","v":1200.99218415036},{"$f":"REGISTRO!D142","v":1200},{"$f":"FIXED(REGISTRO!E142,REGISTRO!J130)","v":"1,0845092"},{"$f":"(V36/U36)*100","v":0.0903757666666667},{"$f":"REGISTRO!E130","v":1.97006685310213},{"$f":"REGISTRO!G130","v":"7,4315"},{"$f":"REGISTRO!I130","v":"001"},{"$f":"IF('OPERACIONES PREVIAS'!$D$16=\"SI\",IFERROR(IF(SUM(V36+Y36)>REGISTRO!AA138,\"NO CONFORME\",\"CONFORME\"),\"\"),\"\")","v":""}]
["NÚMERO DE PÁGINAS:",null,null,{"$f":"IF(F13=\"Página 1 de 2\",2,IF(F13=\"Página 1 de 3\",3,IF(F13=\"Página 1 de 4\",4,IF(F13=\"Página 1 de 5\",5,IF(F13=\"Página 1 de 6\",6,FALSE)))))","v":4},null,null,null,null,"Fecha de calibración:",null,{"$f":"IF(REGISTRO!E4=LISTAS!A17,'CORRECCIÓN EQUIPOS AUX'!C5,'CORRECCIÓN EQUIPOS AUX'!C24)","v":"2020-01-05"},null,null,null,null,null,null,null,null,{"$f":"REGISTRO!C143","v":1492.5341347847},{"$f":"REGISTRO!D143","v":1500},{"$f":"FIXED(REGISTRO!E143,REGISTRO!J131)","v":"-7,3735402"},{"$f":"(V37/U37)*100","v":-0.491569346666667},{"$f":"REGISTRO!E131","v":1.96594232397627},{"$f":"REGISTRO!G131","v":"10,402"},{"$f":"REGISTRO!I131","v":"001"},{"$f":"IF('OPERACIONES PREVIAS'!$D$16=\"SI\",IFERROR(IF(SUM(V37+Y37)>REGISTRO!AA139,\"NO CONFORME\",\"CONFORME\"),\"\"),\"\")","v":""},null,{"$f":"IF('OPERACIONES PREVIAS'!$D$16=\"SI\",\"Regla de desición:\",\"OBSERVACIONES:\")","v":"OBSERVACIONES:"}]
["NUMBER OF PAGES",null,null,null,null,null,null,null,null,null,null,null,null,null,null,null,null,null,null,null,null,null,null,null,null,null,null,null,{"$f":"IF(AND('OPERACIONES PREVIAS'!$D$16=\"SI\",'OPERACIONES PREVIAS'!$K$16=\"CALIBRATION SERVICE S.A.S.\"),LISTAS!A23,IF('OPERACIONES PREVIAS'!$D$16=\"NO\",CONCATENATE(IF(REGISTRO!E4=\"INSTALACIONES DEL CLIENTE \",CONCATENATE(\"La calibración se realizó en sitio en la dirección: \",'OPERACIONES PREVIAS'!D18,\".\"),\"La calibración se realizó en las instalaciones permanentes de Calibration Service S.A.S.\"),\"\n\",'OPERACIONES PREVIAS'!B81),'OPERACIONES PREVIAS'!B21))","v":"La calibración se realizó en las instalaciones permanentes de Calibration Service S.A.S.\n"}]
[null,null,null,null,null,null,null,null,"Instrumento:",null,{"$f":"IF('OPERACIONES PREVIAS'!$D$14<>\"Aire\",'CORRECCIÓN EQUIPOS AUX'!C55,\"-------------------\")","v":"REGLA GRADUADA"},null,null,"Marca:",{"$f":"IF('OPERACIONES PREVIAS'!$D$14<>\"Aire\",'CORRECCIÓN EQUIPOS AUX'!G55,\"-------------------\")","v":"PEC"},null,null,null,null,"Lectura promedio \nPatrón","Lectura promedio\nIBC","Corrección promedio de calibración",null,"Factor de cobertura","Incertidumbre \nExpandida"]
["AUTORIZADO POR:",null,null,null,null,null,null,null,"Serie:",null,{"$f":"IF('OPERACIONES PREVIAS'!$D$14<>\"Aire\",'CORRECCIÓN EQUIPOS AUX'!C56,\"-------------------\")","v":"SN-0085-17 / CS-RP-002"},null,null,"Modelo:",{"$f":"IF('OPERACIONES PREVIAS'!$D$14<>\"Aire\",'CORRECCIÓN EQUIPOS AUX'!G56,\"-------------------\")","v":"7187-204"}]
["AUTHORIZED FOR",null,null,null,null,null,null,null,"Certificado No:",null,{"$f":"IF('OPERACIONES PREVIAS'!$D$14<>\"Aire\",'CORRECCIÓN EQUIPOS AUX'!C57,\"-------------------\")","v":"CD-3115"},null,null,"Intervalo de medición:",null,{"$f":"IF('OPERACIONES PREVIAS'!$D$14<>\"Aire\",'CORRECCIÓN EQUIPOS AUX'!G57,\"-------------------\")","v":"0 mm a 600 mm"},null,null,null,{"$f":"REGISTRO!$G$137","v":"kPa"},{"$f":"REGISTRO!$G$137","v":"kPa"},{"$f":"REGISTRO!$G$137","v":"kPa"},"% Lec.","k",{"$f":"REGISTRO!$G$137","v":"kPa"},"% Lec."]
[null,null,null,null,null,null,null,null,"Fecha de calibración:",null,{"$f":"IF('OPERACIONES PREVIAS'!$D$14<>\"Aire\",'CORRECCIÓN EQUIPOS AUX'!C58,\"-------------------\")","v":"2018-11-19"},null,null,null,null,null,null,null,null,{"$f":"REGISTRO!H138","v":1.550631524},{"$f":"REGISTRO!I138","v":0},{"$f":"REGISTRO!J138","v":2.1871904153649},{"$f":"W32","v":0},{"$f":"REGISTRO!E126","v":1.97189622363391},{"$f":"REGISTRO!K138","v":"49,063"},{"$f":"Z32","v":0},{"$f":"IF(SUM(V32+Y32)>REGISTRO!AA134,\"NO CONFORME\",\"CONFORME\")","v":"CONFORME"}]
[null,null,null,null,null,null,null,null,null,null,null,null,null,null,null,null,null,null,null,{"$f":"REGISTRO!H139","v":2081.48238567328},{"$f":"REGISTRO!I139","v":2068.428},{"$f":"REGISTRO!J139","v":13.6909445646415},{"$f":"(V43/U43)*100","v":0.661900949157597},{"$f":"REGISTRO!E127","v":1.97171884846345},{"$f":"REGISTRO!K139","v":"49,375"},"2,3871"]
[null,null,null,null,null,null,null,null,"INSTRUMENTO CALIBRADO ",null,null,null,null,null,null,null,null,null,null,{"$f":"REGISTRO!H140","v":4131.65005497588},{"$f":"REGISTRO!I140","v":4136.856},{"$f":"REGISTRO!J140","v":-4.56938613275495},{"$f":"(V44/U44)*100","v":-0.110455527887723},{"$f":"REGISTRO!E128","v":1.9708055923849},{"$f":"REGISTRO!K140","v":"50,266"},"1,2151"]
[null,{"$f":"REGISTRO!D161","v":"MICHAEL VALERO"},null,null,null,null,null,null,"Instrumento: ",null,{"$f":"CERTIFICADO!D15","v":"MANÓMETRO ANALÓGICO"},null,null,null,null,null,null,null,null,{"$f":"REGISTRO!H141","v":6171.82142100136},{"$f":"REGISTRO!I141","v":6205.284},{"$f":"REGISTRO!J141","v":-32.8260201072743},{"$f":"(V45/U45)*100","v":-0.529001091767504},{"$f":"REGISTRO!E129","v":1.96664999521195},{"$f":"REGISTRO!K141","v":"59,460"},"001"]
[null,null,{"$f":"REGISTRO!H161","v":"ESPECIALISTA TÉCNICO"},null,null,null,null,null,"División de escala:",null,{"$f":"'OPERACIONES PREVIAS'!K6&\" \"&'OPERACIONES PREVIAS'!L6","v":"25 psi"},null,null,"Serie:",{"$f":"'OPERACIONES PREVIAS'!D8","v":"CR-1419"},null,null,null,null,{"$f":"REGISTRO!H142","v":8280.55287159256},{"$f":"REGISTRO!I142","v":8273.712},{"$f":"REGISTRO!J142","v":7.47743048392848},{"$f":"(V46/U46)*100","v":0.0903757646377887},{"$f":"REGISTRO!E130","v":1.97006685310213},{"$f":"REGISTRO!K142","v":"51,239"},"001"]
[null,null,null,null,null,null,null,null,"Resolución:",null,{"$f":"'OPERACIONES PREVIAS'!K7&\" \"&'OPERACIONES PREVIAS'!L7","v":"12,5 psi"},null,null,"Modelo:",{"$f":"'OPERACIONES PREVIAS'!D7","v":"NO IDENTIFICABLE"},null,null,null,null,{"$f":"REGISTRO!H143","v":10290.6646511482},{"$f":"REGISTRO!I143","v":10342.14},{"$f":"REGISTRO!J143","v":-50.8387899604802},{"$f":"(V47/U47)*100","v":-0.491569346000733},{"$f":"REGISTRO!E131","v":1.96594232397627},{"$f":"REGISTRO!K143","v":"71,722"},"001"]
["“Este certificado expresa única y fielmente el(los) resultado(s) para el ítem bajo calibración descrito. No debe ser reproducido total o parcialmente. Una nueva calibración deberá llevarse a cabo cuando el instrumento sea sometido a golpes, ajustes o reparaciones, independientemente del tiempo transcurrido desde la presente calibración. Los intervalos de calibración deben ser determinados de acuerdo a procedimientos de control establecidos por el usuario. \nCalibration Service S.A.S. no se responsabiliza de la información suministrada por el cliente que pueda afectar a la validez de los resultados; ni de que el(los) resultado(s) corresponda(n) con este registro después de un uso inadecuado del instrumento calibrado por parte del cliente.\n",null,null,null,null,null,null,null,"Clase de exactitud:",null,{"$f":"'OPERACIONES PREVIAS'!K8","v":1.6}]
[null,null,null,null,null,null,null,null,null,null,null,null,null,null,null,null,null,null,null,"Fluido de calibración:",null,{"$f":"'OPERACIONES PREVIAS'!D14","v":"Alcohol"}]
[null,null,null,null,null,null,null,null,"MÉTODO:",null,null,null,null,null,null,null,null,null,null,"IBC:","Instrumento bajo calibración",null,null,null,null,null,null,null,{"$f":"IF(AC37=\"OBSERVACIONES:\",\"\",\"OBSERVACIONES:\")","v":""},null,{"$f":"IF(AC50=\"OBSERVACIONES:\",\"\",\"---FIN DEL CERTIFICADO---\")","v":"---FIN DEL CERTIFICADO---"}]
[null,null,null,null,null,null,null,null,"Comparación directa.",null,null,null,null,null,null,null,null,null,null,"% Lec.:","Porcentaje de lectura",null,null,null,null,null,null,null,{"$f":"IF(AC50=\"OBSERVACIONES:\",CONCATENATE(IF(REGISTRO!E4=\"INSTALACIONES DEL CLIENTE \",CONCATENATE(\"La calibración se realizó en sitio en la dirección: \",'OPERACIONES PREVIAS'!D18,\".\"),\"La calibración se realizó en las instalaciones permanentes de Calibration Service S.A.S.\"),\"\",'OPERACIONES PREVIAS'!B81),\"\")","v":""}]
[null,null,null,null,null,null,null,null,null,null,null,null,null,null,null,null,null,null,null,"Factor de conversión a SI*:",null,{"$f":"REGISTRO!O22&REGISTRO!$P$22&\"  \"&REGISTRO!Q22","v":"1 psi  = 6,89476  kPa"}]
[null,null,null,null,null,null,null,null,"DOCUMENTO DE REFERENCIA:",null,null,null,null,null,null,null,null,null,null,"* NIST 811:2008 Guide for the use of the international System of Units (SI) "]
[null,null,null,null,null,null,null,null,"Procedimiento ME-003 para la calibración de manómetros, vacuómetros y manovacuómetros, edición digital 3 , año 2019, Centro Español de Metrología (CEM).",null,null,null,null,null,null,null,null,null,null,null,null,null,null,null,null,null,null,null,{"$f":"IF(AE50=\"---FIN DEL CERTIFICADO---\",\"\",\"---FIN DEL CERTIFICADO---\")","v":""}]
[]
[]
["Carrera 69A No. 55 - 16 sur, Bogotá D.C., Colombia / PBX : (57) (1) 204 7699 - 728 5146",null,null,null,null,null,null,null,{"$f":"$A$57","v":"Carrera 69A No. 55 - 16 sur, Bogotá D.C., Colombia / PBX : (57) (1) 204 7699 - 728 5146"},null,null,null,null,null,null,null,null,null,{"$f":"$A$57","v":"Carrera 69A No. 55 - 16 sur, Bogotá D.C., Colombia / PBX : (57) (1) 204 7699 - 728 5146"},null,null,null,null,null,null,null,null,null,{"$f":"$A$57","v":"Carrera 69A No. 55 - 16 sur, Bogotá D.C., Colombia / PBX : (57) (1) 204 7699 - 728 5146"}]
["www.calibrationservicesas.com / e-mail: direcciontecnica@calibrationservicesas.com",null,null,null,null,null,null,null,{"$f":"$A$58","v":"www.calibrationservicesas.com / e-mail: direcciontecnica@calibrationservicesas.com"},null,null,null,null,null,null,null,null,null,{"$f":"$A$58","v":"www.calibrationservicesas.com / e-mail: direcciontecnica@calibrationservicesas.com"},null,null,null,null,null,null,null,null,null,{"$f":"$A$58","v":"www.calibrationservicesas.com / e-mail: direcciontecnica@calibrationservicesas.com"}]

{"sheet":"CORRECCIÓN EQUIPOS AUX","index":3,"n_rows":97,"n_cols":25,"rows_kept":97,"cut":false,"hidden":true,"merged":[[1,0,1,1],[1,2,1,4],[1,6,1,8],[2,0,2,1],[2,2,2,4],[2,6,2,8],[3,0,3,1],[3,2,3,4],[4,0,4,1],[4,2,4,4],[6,0,6,7],[7,0,7,7],[12,0,12,5],[15,0,15,5],[20,0,20,1],[20,2,20,4],[20,6,20,8],[20,10,20,11],[20,12,20,14],[20,16,20,18],[21,0,21,1],[21,2,21,4],[21,6,21,8],[21,10,21,11],[21,12,21,14],[21,16,21,18],[22,0,22,1],[22,2,22,4],[22,10,22,11],[22,12,22,14],[23,0,23,1],[23,2,23,4],[23,10,23,11],[23,12,23,14],[25,0,25,7],[26,0,26,7],[26,16,26,22],[31,0,31,5],[34,0,34,5],[54,0,54,1],[54,2,54,4],[54,6,54,8],[55,0,55,1],[55,2,55,4],[55,6,55,8],[56,0,56,1],[56,2,56,4],[57,0,57,1],[57,2,57,4],[59,6,59,11],[59,12,59,14],[73,11,73,12],[92,1,92,13],[93,1,93,2],[95,1,95,13],[96,1,96,2],[3,5,4,5],[22,5,23,5],[56,5,57,5],[60,6,61,6],[60,7,61,7],[60,8,61,8],[60,9,61,9],[60,10,61,10],[60,11,61,11],[60,12,61,12],[60,13,61,13],[60,14,61,14],[22,15,23,15],[56,6,57,8],[3,6,4,8],[22,6,23,8],[22,16,23,18]]}
[]
["Instrumento:",null,"TERMOHIGRÓMETRO DIGITAL",null,null,"Marca:","T&D CORPORATION"]
["Serie:",null,"F80629AA",null,null,"Modelo:","TR-73U"]
["Certificado No:",null,"C4502-20 ",null,null,"Intervalo de medición:","18°C a 28 °C / 30 %HR a 70%HR"]
["Fecha de calibración:",null,"2020-01-05"]
[]
["INSTALACIONES PERMANENTES"]
["Correcciones condiciones ambientales"]
["Patrón","Instrumento","Corrección","U","Patrón","Instrumento","Corrección","U"]
[17.682,18,{"$f":"A10-B10","v":-0.318000000000001},0.087,30.74,31,{"$f":"E10-F10","v":-0.260000000000002},0.8]
[22.767,22,{"$f":"A11-B11","v":0.766999999999999},0.087,49.59,50,{"$f":"E11-F11","v":-0.409999999999997},0.8]
[27.674,27,{"$f":"A12-B12","v":0.673999999999999},0.087,69.49,69,{"$f":"E12-F12","v":0.489999999999995},0.8]
["Mínimo"]
["Temperatura",0.0233,{"$f":"(REGISTRO!F68)^2","v":349.69},-0.154,{"$f":"REGISTRO!F68","v":18.7},13.45096763,"Temp (°C)",{"$f":"(B14*C14)+(D14*E14)+F14","v":18.71894463}]
["Humedad",-0.00137,{"$f":"(REGISTRO!H68)^2","v":3981.61},1.12,{"$f":"REGISTRO!H68","v":63.1},-2.0768,"Hum (%HR)",{"$f":"(B15*C15)+(D15*E15)+F15","v":63.1403943}]
["Máximo"]
["Temperatura",{"$f":"B14","v":0.0233},{"$f":"(REGISTRO!F69)^2","v":357.21},{"$f":"D14","v":-0.154},{"$f":"REGISTRO!F69","v":18.9},{"$f":"F14","v":13.45096763},"Temp (°C)",{"$f":"(B17*C17)+(D17*E17)+F17","v":18.86336063}]
["Humedad",{"$f":"B15","v":-0.00137},{"$f":"(REGISTRO!H69)^2","v":4032.25},{"$f":"D15","v":1.12},{"$f":"REGISTRO!H69","v":63.5},{"$f":"F15","v":-2.0768},"Hum (%HR)",{"$f":"(B18*C18)+(D18*E18)+F18","v":63.5190175}]
[]
[]
["Instrumento:",null,"TERMOHIGRÓMETRO",null,null,"Marca:","EXTECH",null,null,null,"Equipo:",null,"BARÓMETRO",null,null,"Marca:","EXTECH"]
["Serie:",null,"A.078181",null,null,"Modelo:","SD700",null,null,null,"Serie:",null,"A.078181",null,null,"Modelo:","SD700"]
["Certificado No:",null,"C4202",null,null,"Intervalo de medición:","18°C a 28 °C / 30 %HR a 70%HR",null,null,null,"Certificado No:",null,"CERT-18-EMP-1991-3357",null,null,"Intervalo de medición:","500 hPa a 1100 hPa"]
["Fecha de calibración:",null,"2020-02-05",null,null,null,null,null,null,null,"Fecha de calibración:",null,"2018-12-11"]
[]
["SITIO",null,null,null,null,null,null,null,null,null,"Presión atmosferica"]
["Correcciones condiciones ambientales",null,null,null,null,null,null,null,null,null,"Patrón","Indicación","Error","Corrección","± U",null,"Presión atmosferica"]
["Patrón","Instrumento","Corrección","U","Patrón","Instrumento","Corrección","U",null,null,"(hPa)","(hPa)","(hPa)","(hPa)","(hPa)"]
[17.682,17.6,{"$f":"A29-B29","v":0.0819999999999972},0.25,30.74,35.6,{"$f":"E29-F29","v":-4.86},0.87,null,null,499.73,499.9,{"$f":"L29-K29","v":0.169999999999959},{"$f":"M29*-1","v":-0.169999999999959},0.14,null,"Minimo"]
[22.767,22.6,{"$f":"A30-B30","v":0.166999999999998},0.25,49.59,52,{"$f":"E30-F30","v":-2.41},0.87,null,null,559.76,559.9,{"$f":"L30-K30","v":0.139999999999986},{"$f":"M30*-1","v":-0.139999999999986},0.12,null,-1.04e-8,{"$f":"(REGISTRO!J68)^3","v":423903241.728},2.32e-5,{"$f":"(REGISTRO!J68)^2","v":564301.44},0.9841,{"$f":"REGISTRO!J68","v":751.2},3.58,null,{"$f":"(Q30*R30)+(S30*T30)+(U30*V30)+W30","v":751.519119694029}]
[27.674,27.6,{"$f":"A31-B31","v":0.0739999999999981},0.25,69.49,71.1,{"$f":"E31-F31","v":-1.61},0.87,null,null,634.8,635,0.200000000000045,-0.200000000000045,0.11]
["Minimo",null,null,null,null,null,null,null,null,null,709.83,710.1,0.269999999999982,-0.269999999999982,0.1,null,"Máximo"]
["Temperatura",0.00357,{"$f":"(REGISTRO!F68)^2","v":349.69},0.839,{"$f":"REGISTRO!F68","v":18.7},1.650605,"Temp (°C)",{"$f":"(B33*C33)+(D33*E33)+F33","v":18.5882983},null,null,784.85,785.3,0.449999999999932,-0.449999999999932,0.1,null,{"$f":"Q30","v":-1.04e-8},{"$f":"(REGISTRO!J69)^3","v":425598400.648},{"$f":"S30","v":2.32e-5},{"$f":"(REGISTRO!J69)^2","v":565804.84},{"$f":"U30","v":0.9841},{"$f":"(REGISTRO!J69)","v":752.2},{"$f":"W30","v":3.58},null,{"$f":"(Q33*R33)+(S33*T33)+(U33*V33)+W33","v":752.520468921261}]
["Humedad",0.00232,{"$f":"(REGISTRO!H68)^2","v":3981.61},0.684,{"$f":"REGISTRO!H68","v":63.1},12.386967,"Hum (%HR)",{"$f":"(B34*C34)+(D34*E34)+F34","v":64.7847022},null,null,859.87,860.4,0.529999999999973,-0.529999999999973,0.1]
["Máximo",null,null,null,null,null,null,null,null,null,934.89,935.4,0.509999999999991,-0.509999999999991,0.1]
["Temperatura",{"$f":"B33","v":0.00357},{"$f":"(REGISTRO!F69)^2","v":357.21},{"$f":"D33","v":0.839},{"$f":"REGISTRO!F69","v":18.9},{"$f":"F33","v":1.650605},"Temp (°C)",{"$f":"(B36*C36)+(D36*E36)+F36","v":18.7829447},null,null,1009.9,1010.4,0.5,-0.5,0.11]
["Humedad",{"$f":"B34","v":0.00232},{"$f":"(REGISTRO!H69)^2","v":4032.25},{"$f":"D34","v":0.684},{"$f":"(REGISTRO!H69)","v":63.5},{"$f":"F34","v":12.386967},"Hum (%HR)",{"$f":"(B37*C37)+(D37*E37)+F37","v":65.175787},null,null,1099.91,1100.3,0.389999999999873,-0.389999999999873,0.13]
[]
[]
[]
[]
[]
[]
[]
[]
[]
[]
[]
[]
[]
[]
[]
[]
[]
["Instrumento:",null,"REGLA GRADUADA",null,null,"Marca:","PEC"]
["Serie:",null,"SN-0085-17 / CS-RP-002",null,null,"Modelo:","7187-204"]
["Certificado No:",null,"CD-3115",null,null,"Intervalo de medición:","0 mm a 600 mm"]
["Fecha de calibración:",null,"2018-11-19"]
[]
[null,"Errores certificado anterior (2017)",null,null,null,null,"Resultados de la calibración",null,null,null,null,null,"Curva de ajuste"]
[null,null,null,null,null,null,"Lectura \nPatrón","Lectura \nIBC","Error de \nmedición","U\nExpandida","Error anterior","Deriva","Error \nestimado","Error \nresidual","U\nTotal"]
[null,"Nominal (mm)","Error (mm)"]
[null,null,0,null,null,null,"mm","mm","mm","µm","mm","mm","mm","mm","µm"]
[null,60,-0.07,null,null,null,60,59.93,{"$f":"H64-G64","v":-0.0700000000000003},0.02,-0.0700000000000003,{"$f":"J64/SQRT(3)","v":0.0115470053837925},{"$f":"((1.0001*G64)-0.0837)-G64","v":-0.0777000000000001},{"$f":"M64-I64","v":-0.00769999999999982},{"$f":"SQRT(J64^2+(2*$N$74)^2)","v":0.029891804897062}]
[null,120,-0.075,null,null,null,120,119.925,-0.0750000000000028,0.02,-0.0750000000000028,0.0115470053837925,{"$f":"((1.0001*G65)-0.0837)-G65","v":-0.0716999999999928},0.00330000000001007,0.029891804897062]
[null,180,-0.065,null,null,null,180,179.935,-0.0649999999999977,0.02,-0.0649999999999977,0.0115470053837925,-0.0656999999999925,-0.000699999999994816,0.029891804897062]
[null,240,-0.065,null,null,null,240,239.935,-0.0649999999999977,0.02,-0.0649999999999977,0.0115470053837925,-0.0596999999999923,0.00530000000000541,0.029891804897062]
[null,300,-0.05,null,null,null,300,299.95,-0.0500000000000114,0.02,-0.0500000000000114,0.0115470053837925,-0.0537000000000489,-0.00370000000003756,0.029891804897062]
[null,360,-0.03,null,null,null,360,359.97,-0.0299999999999727,0.02,-0.0299999999999727,0.0115470053837925,-0.0477000000000203,-0.0177000000000476,0.029891804897062]
[null,420,-0.04,null,null,null,420,419.96,-0.0400000000000205,0.02,-0.0400000000000205,0.0115470053837925,-0.0417000000000485,-0.00170000000002801,0.029891804897062]
[null,480,-0.04,null,null,null,480,479.96,-0.0400000000000205,0.02,-0.0400000000000205,0.0115470053837925,-0.0357000000000198,0.00430000000000064,0.029891804897062]
[null,540,-0.02,null,null,null,540,539.98,-0.0199999999999818,0.02,-0.0199999999999818,0.0115470053837925,-0.029700000000048,-0.00970000000006621,0.029891804897062]
[null,600,-0.015,null,null,null,600,599.985,-0.0149999999999864,0.02,-0.0149999999999864,0.0115470053837925,-0.0237000000000762,-0.00870000000008986,0.029891804897062]
[null,null,null,null,null,null,null,null,null,null,null,"Error Típico",null,{"$f":"SQRT(SUMSQ(N64:N73)/(10-COUNTA(C87:C91)-1))","v":0.0111076550180947}]
[]
[null,"Errores certificado actual (2018-11-19)"]
[]
[null,"Nominal","Error","U expandida","Deriva","Error estimado","Error residual","U total","Corrección"]
[null,"(mm)","(mm)","(mm)","(mm)","(mm)","(mm)","(mm)","(mm)"]
[null,100,-0.103,0.04,{"$f":"D80/SQRT(3)","v":0.023094010767585},{"$f":"($C$87)+($C$88*B80)+($C$89*B80^2)+($C$90*B80^3)+($C$91*B80^4)-B80","v":-0.0981199999999944},{"$f":"F80-C80","v":0.00488000000000556},{"$f":"SQRT(SUMSQ((D80/2),$F$90))","v":0.0315553989041518},{"$f":"C80*-1","v":0.103}]
[null,200,-0.049,0.04,0.023094010767585,-0.0667600000000164,-0.0177600000000164,{"$f":"SQRT(SUMSQ((D81/2),$F$90))","v":0.0315553989041518},0.049]
[null,300,-0.094,0.04,0.023094010767585,-0.0690400000000295,0.0249599999999705,{"$f":"SQRT(SUMSQ((D82/2),$F$90))","v":0.0315553989041518},0.094]
[null,400,-0.078,0.04,0.023094010767585,-0.0930800000000431,-0.0150800000000431,0.0315553989041518,0.078]
[null,500,-0.128,0.04,0.023094010767585,-0.126999999999953,0.0010000000000473,0.0315553989041518,0.128]
[null,600,-0.158,0.04,0.023094010767585,-0.158919999999853,-0.000919999999852733,0.0315553989041518,0.158]
[]
[null,"a0",-0.175,null,null,null,"U máx",{"$f":"MAX(H80:H85)","v":0.0315553989041518},"mm"]
[null,"a1",1.001036]
[null,"a2",-2.87e-6,null,"Suma",{"$f":"SUMSQ(G80:G85)","v":0.00119148640000029}]
[null,"a3",1.98e-9,null,"u pol",{"$f":"SQRT((F89)/(COUNT(B80:B85)-COUNTA(C87:C91)))","v":0.0244078511958784}]
[null,"a4"]
[]
[null,"CORRECCIÓN DIFERENCIA DE ALTURAS"]
[null,"Altura Patrón:",null,0,{"$f":"('OPERACIONES PREVIAS'!K14)^5","v":320000000000},0,{"$f":"('OPERACIONES PREVIAS'!K14)^4","v":1600000000},{"$f":"C90","v":1.98e-9},{"$f":"('OPERACIONES PREVIAS'!K14)^3","v":8000000},{"$f":"C89","v":-2.87e-6},{"$f":"('OPERACIONES PREVIAS'!K14)^2","v":40000},{"$f":"C88","v":1.001036},{"$f":"'OPERACIONES PREVIAS'!K14","v":200},{"$f":"C87","v":-0.175},null,{"$f":"(D94*E94)+(F94*G94)+(H94*I94)+(J94*K94)+(L94*M94)+N94","v":199.93324},{"$f":"'OPERACIONES PREVIAS'!K14+'CORRECCIÓN EQUIPOS AUX'!P94","v":399.93324}]
[]
[null,"CORRECCIÓN DIFERENCIA DE ALTURAS"]
[null,"Altura IBC:",null,{"$f":"D94","v":0},{"$f":"('OPERACIONES PREVIAS'!K15)^5","v":796262400000},{"$f":"F94","v":0},{"$f":"('OPERACIONES PREVIAS'!K15)^4","v":3317760000},{"$f":"H94","v":1.98e-9},{"$f":"('OPERACIONES PREVIAS'!K15)^3","v":13824000},{"$f":"J94","v":-2.87e-6},{"$f":"('OPERACIONES PREVIAS'!K15)^2","v":57600},{"$f":"L94","v":1.001036},{"$f":"'OPERACIONES PREVIAS'!K15","v":240},{"$f":"N94","v":-0.175},null,{"$f":"(D97*E97)+(F97*G97)+(H97*I97)+(J97*K97)+(L97*M97)+N97","v":239.93569952},{"$f":"'OPERACIONES PREVIAS'!K15+'CORRECCIÓN EQUIPOS AUX'!P97","v":479.93569952}]

{"sheet":"LISTADO DE PATRONES","index":4,"n_rows":13,"n_cols":12,"rows_kept":13,"cut":false,"hidden":true,"merged":[[0,0,0,11],[1,0,2,0],[1,1,2,1],[1,2,2,2],[1,3,2,3],[1,4,2,4],[1,5,2,5],[1,6,2,6],[1,7,2,7],[1,8,2,8],[1,9,2,9],[1,10,2,10],[1,11,2,11]]}
["DATOS DE LOS PATRONES DE TRABAJO USADOS EN LA CALIBRACIÓN"]
["RANGO EN \npsi","MARCA","MODELO","SERIE","RANGO","NÚMERO DE CERTIFICADO","FECHA DE CALIBRACIÓN","PRÓXIMA CALIBRACIÓN","PRECISIÓN","TOLERANCIA","DERIVA","RESOLUCIÓN"]
[]
[15,"FLUKE","2700G-BG100K","CS-MP-013 / 3329023","0 a 100 kPa \n(0 a 15 psi)","LPR200098a","2020-01-24","2022-01-24",0.0002,{"$f":"(I4*A4)","v":0.003},0.003,0.0001]
[50,"ADDITEL","ADT672","CS-MP-008 / 27312090063","0 a 345 kPa \n(0 a 50 psi)","LPR200099","2020-01-24","2022-01-24",0.00025,0.0125,0.0125,0.001]
[300,"AMETEK","IPI300CBXXINDG","CS-MP-005 / 9615005","0 a 2068 kPa \n(0 a 300 psi)","LRP200101","2020-01-23","2022-01-23",0.0005,0.15,0.15,0.001]
[1000,"ADDITEL","ADT672","CS-MP-011 / 27312330044","0 a 6895 kPa \n(0 a 1000 psi)","LPR200103","2020-01-24","2022-01-24",0.00025,0.25,0.25,0.001]
[3000,"ADDITEL","ADT672","CS-MP-010 / 27312320013"," 0 a 20648 kPa \n(300 a 3000 psi)","LPR181275a","2018-10-12","2020-10-12",0.00025,0.75,0.75,0.001]
[5000,"ADDITEL","ADT672","CS-MP-009 / 27312330020","0 a 34474 kPa \n(0 a 5000 psi)","LPR-161115","2016-07-18","2019-07-18",0.00025,1.25,1.25,0.001]
[10000,"FLUKE ","FLUKE 2700G","CS-MP-017 / 3743515"," 0 a 68948 kPa \n(0 a 10000 psi)","LPR200096","2020-01-27","2022-01-27",0.0002,2,2,0.1]
[36000,"ADDITEL","ADT672","CS MP-012 / 27312420004","0 a 248211 kPa \n(0 a 36000 psi)","LPR-161118","2016-07-21","2021-07-21",0.001,36,36,0.001]
[-15,"FLUKE","2700G-BG100K",{"$f":"D4","v":"CS-MP-013 / 3329023"},"0 a -100 kPa \n(0 a -15 psi)","LPR200097","2020-01-24","2022-01-24",0.0005,-0.0075,0.003,0.0001]
[-30,"AMETEK","IPI300CBXXINDG",{"$f":"D6","v":"CS-MP-005 / 9615005"},"(-30 inHg a 300 psi)","LRP200102","2020-01-23","2022-01-23",0.0005,-0.015,0.15,0.001]

{"sheet":"PRESUPUESTO DE U","index":5,"n_rows":95,"n_cols":19,"rows_kept":95,"cut":false,"hidden":true,"merged":[[0,1,0,14],[7,3,7,12],[30,1,30,3],[32,6,32,11],[33,6,33,11],[34,6,34,11],[35,6,35,11],[38,6,38,11],[39,6,39,11],[40,6,40,11],[43,6,43,11],[44,6,44,11],[45,6,45,11],[48,6,48,11],[49,6,49,11],[50,6,50,11],[51,6,51,11],[52,6,52,11],[53,6,53,11],[54,6,54,11],[55,6,55,11],[56,6,56,11],[69,6,69,7],[102,1,102,14],[0,0,102,0],[25,1,28,1],[70,1,73,1],[74,1,76,1],[77,1,82,1],[83,1,86,1],[87,1,89,1],[90,1,91,1],[92,1,93,1],[81,2,82,2],[67,3,69,3],[81,3,82,3],[36,4,37,4],[41,4,42,4],[46,4,47,4],[81,4,82,4],[36,5,37,5],[41,5,42,5],[46,5,47,5],[81,5,82,5],[83,5,86,5],[87,5,89,5],[90,5,91,5],[92,5,93,5],[94,5,95,5],[81,6,82,6],[83,6,86,6],[92,6,93,6],[94,6,95,6],[81,7,82,7],[67,8,69,8],[81,8,82,8],[67,9,69,9],[81,9,82,9],[67,10,69,10],[81,10,82,10],[81,11,82,11],[81,12,82,12],[4,13,5,13],[6,13,7,13],[67,13,69,13],[81,13,82,13],[4,14,5,14],[6,14,7,14],[67,14,69,14],[77,14,82,14],[67,1,69,2],[67,11,69,12],[46,6,47,11],[41,6,42,11],[36,6,37,11],[87,2,89,4],[90,2,91,4],[92,2,93,4],[57,4,58,11],[67,4,68,7],[94,1,95,4],[83,2,86,4],[1,3,3,12],[4,3,6,12],[1,1,7,2],[1,13,3,14]]}
[]
[null,null,null,"REQUISITOS DE GESTIÓN TÉCNICA",null,null,null,null,null,null,null,null,null,"FLAB-07-P1"]
[]
[]
[null,null,null,"CERTIFICADO DE CALIBRACIÓN DE MANÓMETROS, VACUÓMETROS Y MANOVACUÓMETROS",null,null,null,null,null,null,null,null,null,"Revisión:",3]
[]
[null,null,null,null,null,null,null,null,null,null,null,null,null,"Versión:",3]
[null,null,null,"PRESUPUESTO DE U"]
[]
[]
[]
[]
[]
[]
[]
[]
[]
[]
[]
[]
[]
[null,"MENSURANDO:",null,"Correccióm de calibración"]
[]
[null,"MODELO:"]
[]
[null,"ECUACIÓN MODELO:"]
[]
[]
[]
[]
[null,"LISTADO DE VARIABLES"]
[]
[null,null,null,null,"Magnitud","Unidad","Descripción"]
[null,null,null,null,"C","Pa","Corrección de la calibración final"]
[null,null,null,null,"PRi","Pa","Es el valor de la lectura del Patrón "]
[null,null,null,null,"Pxi","Pa","Es el valor de la lectura del instrumento"]
[null,null,null,null,"δ(Pat)","Pa","Es la suma de las correcciones debidas al Patrón, nulas o no, que van a tener contribución en la incertidumbre."]
[]
[null,null,null,null,"δCal","Pa","Corrección de calibración del patrón (certificado de calibración)."]
[null,null,null,null,"δDer","Pa","Corrección debida a la deriva del patrón."]
[null,null,null,null,"δTem","Pa","Corrección debida a temperatura (Patrón)."]
[null,null,null,null,"δ(IBC)","Pa","Es la suma de las correcciones debidas al instrumento, nulas o no, que van a tener contribución en la incertidumbre."]
[]
[null,null,null,null,"δRes","Pa","Corrección debida a resolución del IBC."]
[null,null,null,null,"δHis","Pa","Corrección debida a temperatura (IBC)."]
[null,null,null,null,"δTem","Pa","Corrección debida a histéresis del IBC."]
[null,null,null,null,"ΔNR","Pa","Es la corrección por diferencia de alturas entre los niveles de referencia."]
[]
[null,null,null,null,"ρf","k/m3","Es la densidad del fluido manométrico"]
[null,null,null,null,"ρa","k/m3","Es la densidad del aire"]
[null,null,null,null,"gl","m/s2","Gravedad"]
[null,null,null,null,"h","m","Diferencia de altura"]
[null,null,null,null,"u","Pa","Incertidumbre estandar"]
[null,null,null,null,"uc","Pa","Incertidumbre combinada estandar"]
[null,null,null,null,"veff",null,"Grados efectivos de libertad"]
[null,null,null,null,"k95,45%",null,"Factor de covertura, 95,45% nivel de confianza"]
[null,null,null,null,"U","Pa","Incertidumbre expandida"]
[null,null,null,null,"Las correcciones debidas al patrón, al instrumento toman el valor cero. No ocurre lo mismo con sus contribuciones a la incertidumbre: "]
[]
[]
[null,"PRESUPUESTO DE INCERTIDUMBRES"]
[]
[]
[null,null,"Vnominal","PRi","Pxi","C","k","U"]
[null,null,0,{"$f":"VLOOKUP(C65,REGISTRO!B138:D143,2,0)","v":0.2249},{"$f":"VLOOKUP('PRESUPUESTO DE U'!C65,REGISTRO!B138:D143,3,0)","v":0},{"$f":"D65-E65+SUM(D72:D74)+SUM(D75:D77)+D82","v":92.5499252894813},{"$f":"F91","v":{"$error":"#DIV/0!"}},{"$f":"F93","v":{"$error":"#DIV/0!"}}]
[]
[]
[null,"Magnitud",null,"Estimación","Incertidumbres Estándar",null,null,null,"Distribución de Probabilidad","Coeficiente de Sensibilidad","Grados de Libertad","Contribución a la  Incertidumbre",null,"Unidad","Contribución a la  Incertidumbre"]
[null,null,null,null,null,null,null,null,null,null,null,null,null,null,null,null,null,{"$f":"\"Contribución en (\"&N71&\")\"","v":"Contribución en (psi)"},"Contribución en (%)"]
[null,null,null,null,"Símbolo","Valor","Incertidumbre estándar"]
[null,"δ(IBC)","PRi - Pxi",{"$f":"D65-E65","v":0.2249},"u(δRep)",{"$f":"VLOOKUP($C$65,REGISTRO!$B$114:$J$119,2,0)","v":0}," σ/√n",{"$f":"F71/SQRT(4)","v":0},"Normal",1,3,"u(δRep) * 1",{"$f":"J71*H71","v":0},{"$f":"'OPERACIONES PREVIAS'!$D$9","v":"psi"},{"$f":"M71^2/SUMSQ(M71:M74,M75:M77,M82)","v":0},null,null,{"$f":"M71","v":0},{"$f":"O71","v":0}]
[null,null,"δRes",0,"u(δRes)",{"$f":"VLOOKUP($C$65,REGISTRO!$B$114:$J$119,3,0)","v":3.60843918243516},"Res  / 2√3",{"$f":"F72/SQRT(12)","v":1.04166666666667},"Rectangular",1,200,"u(δRes) * 1",1.04166666666667,{"$f":"'OPERACIONES PREVIAS'!$D$9","v":"psi"},{"$f":"M72^2/SUMSQ(M71:M74,M75:M77,M82)","v":0.999581377606083},null,null,{"$f":"M72","v":1.04166666666667},{"$f":"O72","v":0.999581377606083}]
[null,null,"δHis",0,"u(δHis)",{"$f":"VLOOKUP($C$65,REGISTRO!$B$114:$J$119,4,0)","v":0},"His  / 2√3",{"$f":"F73/SQRT(12)","v":0},"Rectangular",1,200,"u(δHis) * 1",0,{"$f":"'OPERACIONES PREVIAS'!$D$9","v":"psi"},{"$f":"M73^2/SUMSQ(M71:M74,M75:M77,M82)","v":0},null,null,0,0]
[null,null,"δTem",0,"u(δTem)",{"$f":"VLOOKUP($C$65,REGISTRO!$B$114:$J$119,5,0)","v":0},"Tem  / 2√3",{"$f":"F74/SQRT(12)","v":0},"Rectangular",1,200,"u(δTem) * 1",0,{"$f":"'OPERACIONES PREVIAS'!$D$9","v":"psi"},{"$f":"M74^2/SUMSQ(M71:M74,M75:M77,M82)","v":0},null,null,0,0]
[null,"δ(Pat)","δCal",0,"u(δCal)",{"$f":"VLOOKUP($C$65,REGISTRO!$B$114:$J$119,7,0)","v":0.042},"U / k",{"$f":"F75/2","v":0.021},"Normal",1,200,"u(δCal) * 1",0.021,{"$f":"'OPERACIONES PREVIAS'!$D$9","v":"psi"},{"$f":"M75^2/SUMSQ(M71:M74,M75:M77,M82)","v":0.000406255461142379},null,null,0.021,0.000406255461142379]
[null,null,"δDer",0,"u(δDer)",{"$f":"VLOOKUP($C$65,REGISTRO!$B$114:$J$119,8,0)","v":0.00866025403784767},"Der / 2√3",{"$f":"F76/SQRT(12)","v":0.00250000000000095},"Rectangular",1,200,"u(δDer) * 1",0.00250000000000095,{"$f":"'OPERACIONES PREVIAS'!$D$9","v":"psi"},{"$f":"M76^2/SUMSQ(M71:M74,M75:M77,M82)","v":5.7575887350154e-6},null,null,0.00250000000000095,5.7575887350154e-6]
[null,null,"δTem",0,"u(δTem)",{"$f":"VLOOKUP($C$65,REGISTRO!$B$114:$J$119,9,0)","v":0},"Tem  / 2√3",{"$f":"F77/SQRT(12)","v":0},"Rectangular",1,200,"u(δTem) * 1",0,{"$f":"'OPERACIONES PREVIAS'!$D$9","v":"psi"},{"$f":"M77^2/SUMSQ(M71:M74,M75:M77,M82)","v":0},null,null,0,0]
[null,"ΔNR","ρf",{"$f":"REGISTRO!I10","v":812.8},"u(ρf)",{"$f":"REGISTRO!J10","v":81.28},"ρf / 2√3",{"$f":"F78/SQRT(12)","v":23.4635149398664},"Rectangular","gL * h",200,"u(ρf) * (gL * h)",{"$f":"(D80*IF($D$81=0,$F$81,$D$81)*H78)","v":18.3959612609011},"Pa",{"$f":"M82^2/SUMSQ(M71:M74,M75:M77,M82)","v":6.6093440398631e-6},null,null,{"$f":"M82","v":0.00267854451409767},6.6093440398631e-6]
[null,null,"ρa",{"$f":"REGISTRO!I11","v":0.8876},"u(ρa)",{"$f":"REGISTRO!J11","v":0.012},"ρa  / 2√3",{"$f":"F79/SQRT(12)","v":0.00346410161513775},"Rectangular","- gL *h",200,"u(ρa)*(- gL *h)",{"$f":"(-D80*IF($D$81=0,$F$81,$D$81))*H79","v":-0.00271593916253461},"Pa"]
[null,null,"gL",{"$f":"REGISTRO!I12","v":9.8},"u(gL)",{"$f":"REGISTRO!J12","v":0.05},"gL  / k",{"$f":"F80/2","v":0.025},"Normal","(ρf - ρa) * h",200,"u(gL)*(ρf - ρa) * h",{"$f":"((D78-D79)*IF($D$81=0,$F$81,$D$81))*H80","v":1.62387472286965},"Pa"]
[null,null,"h",{"$f":"REGISTRO!I9","v":0.0800024595200001},"u(h)",{"$f":"REGISTRO!J9","v":3.15553989041518e-5},"h  / k",{"$f":"F81/2","v":1.57776994520759e-5},"Normal","(ρf - ρa) * gL",200,"u(h)*(ρf - ρa) * gL",{"$f":"((D78-D79)*D80)*H81","v":0.125539076320413},"Pa"]
[null,null,"ΔNR",{"$f":"((D78-D79)*D80*D81)/F.C","v":92.3250252894812},"u(ΔNR)",{"$f":"REGISTRO!I14","v":0.0923250252894812},{"$f":"N82","v":"psi"},{"$f":"SQRT(SUMSQ(M78:M81))","v":18.4679215740201},"Normal",1,200,"u(ΔNR) * 1",{"$f":"REGISTRO!J104","v":0.00267854451409767},{"$f":"'OPERACIONES PREVIAS'!$D$9","v":"psi"}]
[null,null,null,null,null,null,{"$f":"N83","v":0}]
[null,"uc",null,null,null,{"$f":"SQRT(SUMSQ(M71,M72,M73,M74,M75,M76,M77,M82))","v":1.04188476764235},{"$f":"'OPERACIONES PREVIAS'!$D$9","v":"psi"}]
[null,null,null,null,null,null,null,null,null,"u(δRep)"]
[null,null,null,null,null,null,null,null,null,"u(δRes)"]
[null,null,null,null,null,null,null,null,null,"u(δHis)"]
[null,"vef",null,null,null,{"$f":"(F84^4)/(M71^4/K71)+(M72^4/K72)+(M73^4/K73)+(M74^4/K74)+(M75^4/K75)+(M76^4/K76)+(M77^4/K77)++(M82^4/K82)","v":{"$error":"#DIV/0!"}},null,null,null,"u(δTem)"]
[null,null,null,null,null,null,null,null,null,"u(δCal)"]
[null,null,null,null,null,null,null,null,null,"u(δDer)"]
[null,"k95,45%",null,null,null,{"$f":"TINV((100%-95.45%),F88)","v":{"$error":"#DIV/0!"}},null,null,null,"u(δTem)"]
[null,null,null,null,null,null,null,null,null,"u(ΔNR)"]
[null,"U","uc*k",null,null,{"$f":"F91*F84","v":{"$error":"#DIV/0!"}},{"$f":"'OPERACIONES PREVIAS'!$D$9","v":"psi"}]
[]
[null,null,null,null,null,{"$f":"D65-E65+SUM(D72:D74)+SUM(D75:D77)+F82","v":0.317225025289481},{"$f":"'OPERACIONES PREVIAS'!$D$9","v":"psi"}]

{"sheet":"TABLA DE CONVERSIÓN","index":6,"n_rows":14,"n_cols":13,"rows_kept":14,"cut":false,"hidden":true,"merged":[[0,0,0,12]]}
["TABLAS DE CONVERSIÓN PARA UNIDADES DE PRESIÓN - NTC 3669:1995"]
["UNIDADES","Pa","kPa","MPa","bar","mbar","psi","kg/cm²","kgf/m2","inHg","inH2o","mmHg","mmH2o"]
["Pa",1,0.001,1e-6,1e-5,0.01,0.0001450377,1.019716e-5,0.1019716,0.0002952999,248.84,0.007500617]
["kPa",1000,1,0.001,0.01,10,0.1450377,0.01019716,101.9716,0.2952999,0.24884,7.500617]
["MPa",1000000,1000,1,10,10000,145.0377,10.19716,101971.6,295.2999,null,7500.617]
["bar",100000,100,0.1,1,1000,14.50377,1.019716,10197.16,29.52999,null,750.0617]
["mbar",100,0.1,0.0001,0.001,1,0.01450377,0.001019716,10.19716,0.02952999,null,0.7500617]
["psi",6894.76,6.89476,0.006894757,0.0689476,68.94757,1,0.070307,703.0696,2.036021,0.0360912,51.71493]
["kgf/cm2",98066.5,98.0665,0.0980665,0.980665,980.665,14.22334,1,10000,28.95903,null,735.5592]
["kgf/m2",9.80665,0.00980665,9.80665e-6,9.80665e-5,0.0980665,0.001422334,0.0001,1,0.002895903,null,0.07355592]
["inHg",3386.39,3.38639,0.00338639,0.03386388,33.86388,0.4911541,0.03453155,345.3155,1,null,25.4]
["inH2o",284.84,0.24884,null,null,null,0.0360912,null,null,null,1]
["mmHg",133.322,0.133322,0.00013332,0.001333224,1.333224,0.01933677,0.00135951,13.5951,0.03937008,null,1]
["mmH2o",null,null,null,null,null,null,null,null,null,null,null,1]

{"sheet":"CURVAS DE AJUSTE","index":7,"n_rows":89,"n_cols":120,"rows_kept":89,"cut":false,"hidden":true,"merged":[[4,2,4,7],[4,8,4,10],[4,14,4,19],[4,20,4,22],[4,26,4,31],[4,32,4,34],[4,38,4,43],[4,44,4,46],[4,50,4,55],[4,56,4,58],[4,62,4,67],[4,68,4,70],[4,74,4,79],[4,80,4,82],[4,86,4,91],[4,92,4,94],[4,98,4,103],[4,104,4,106],[4,110,4,115],[4,116,4,118],[18,7,18,8],[18,19,18,20],[18,31,18,32],[18,43,18,44],[18,55,18,56],[18,67,18,68],[18,79,18,80],[18,91,18,92],[18,103,18,104],[18,115,18,116],[20,104,20,105],[20,115,20,116],[21,19,21,20],[21,31,21,32],[21,43,21,44],[21,55,21,56],[21,68,21,69],[21,80,21,81],[21,92,21,93],[25,5,25,6],[5,2,6,2],[5,3,6,3],[34,3,35,3],[5,4,6,4],[34,4,35,4],[5,5,6,5],[34,5,35,5],[5,6,6,6],[5,8,6,8],[5,9,6,9],[5,10,6,10],[5,14,6,14],[5,15,6,15],[33,15,34,15],[5,16,6,16],[33,16,34,16],[5,17,6,17],[33,17,34,17],[5,18,6,18],[5,20,6,20],[5,21,6,21],[5,22,6,22],[47,23,48,23],[5,26,6,26],[5,27,6,27],[32,27,33,27],[5,28,6,28],[32,28,33,28],[5,29,6,29],[32,29,33,29],[5,30,6,30],[5,32,6,32],[5,33,6,33],[5,34,6,34],[5,38,6,38],[5,39,6,39],[32,39,33,39],[5,40,6,40],[32,40,33,40],[5,41,6,41],[32,41,33,41],[5,42,6,42],[5,44,6,44],[5,45,6,45],[5,46,6,46],[5,50,6,50],[5,51,6,51],[32,51,33,51],[5,52,6,52],[32,52,33,52],[5,53,6,53],[32,53,33,53],[5,54,6,54],[5,56,6,56],[5,57,6,57],[20,57,22,57],[5,58,6,58],[5,62,6,62],[5,63,6,63],[32,63,33,63],[5,64,6,64],[32,64,33,64],[5,65,6,65],[32,65,33,65],[5,66,6,66],[5,68,6,68],[5,69,6,69],[5,70,6,70],[5,74,6,74],[5,75,6,75],[32,75,33,75],[5,76,6,76],[32,76,33,76],[5,77,6,77],[32,77,33,77],[5,78,6,78],[5,80,6,80],[5,81,6,81],[5,82,6,82],[5,86,6,86],[5,87,6,87],[32,87,33,87],[5,88,6,88],[32,88,33,88],[5,89,6,89],[32,89,33,89],[5,90,6,90],[5,92,6,92],[5,93,6,93],[5,94,6,94],[5,98,6,98],[5,99,6,99],[32,99,33,99],[5,100,6,100],[32,100,33,100],[5,101,6,101],[32,101,33,101],[5,102,6,102],[5,104,6,104],[5,105,6,105],[5,106,6,106],[5,110,6,110],[5,111,6,111],[32,111,33,111],[5,112,6,112],[32,112,33,112],[5,113,6,113],[32,113,33,113],[5,114,6,114],[5,116,6,116],[5,117,6,117],[5,118,6,118],[1,25,2,35],[1,37,2,47],[1,49,2,59],[1,61,2,71],[1,73,2,83],[1,85,2,95],[1,97,2,107],[1,109,2,119],[1,1,2,11],[1,13,2,23],[19,94,23,95]]}
[]
[null,"MANÓMETRO FLUKE DE 0 a 100 kPa (0 a 15 psi)",null,null,null,null,null,null,null,null,null,null,null,"MANÓMETRO ADDITEL DE 0 a 345 kPa (0 a 50 psi)",null,null,null,null,null,null,null,null,null,null,null,"MANÓMETRO AMETEK DE 0 a 2 068 kPa (0 a 300 psi)",null,null,null,null,null,null,null,null,null,null,null,"MANÓMETRO ADDITEL DE 0 a 6 895 kPa (0 a 1 000 psi)",null,null,null,null,null,null,null,null,null,null,null,"MANÓMETRO ADDITEL DE 0 a 20 648 kPa (0 a 3 000 psi)",null,null,null,null,null,null,null,null,null,null,null,"MANÓMETRO ADDITEL DE 0 a 34 474 kPa (0 a 5 000 psi)",null,null,null,null,null,null,null,null,null,null,null,"MANÓMETRO FLUKE DE 0 a 68948 kPa (0 a 10000 psi)",null,null,null,null,null,null,null,null,null,null,null,"MANÓMETRO ADDITEL DE 0 a 24 8211 kPa (0 a 36 000 psi)",null,null,null,null,null,null,null,null,null,null,null,"VACUÓMETRO FLUKE  DE 0 a -100 kPa (0 a -15 psi)",null,null,null,null,null,null,null,null,null,null,null,"VACUÓMETRO AMETEK DE 0 a -100 kPa (0 a -30 inHg)"]
[]
[null,null,null,null,null,null,null,null,null,null,null,"OK",null,null,null,null,null,null,null,null,null,null,null,"OK",null,null,null,null,null,null,null,null,null,null,null,"OK",null,null,null,null,null,null,null,null,null,null,null,"OK",null,null,null,null,null,null,null,null,null,null,null,"OK",null,null,null,null,null,null,null,null,null,null,null,"OK",null,null,null,null,null,null,null,null,null,null,null,"OK",null,null,null,null,null,null,null,null,null,null,null,"OK",null,null,null,null,null,null,null,null,null,null,null,"OK",null,null,null,null,null,null,null,null,null,null,null,"OK"]
[null,null,"Resultados de la calibración",null,null,null,null,null,"Curva de ajuste",null,null,null,null,null,"Resultados de la calibración",null,null,null,null,null,"Curva de ajuste",null,null,null,null,null,"Resultados de la calibración",null,null,null,null,null,"Curva de ajuste",null,null,null,null,null,"Resultados de la calibración",null,null,null,null,null,"Curva de ajuste",null,null,null,null,null,"Resultados de la calibración",null,null,null,null,null,"Curva de ajuste",null,null,null,null,null,"Resultados de la calibración",null,null,null,null,null,"Curva de ajuste",null,null,null,null,null,"Resultados de la calibración",null,null,null,null,null,"Curva de ajuste",null,null,null,null,null,"Resultados de la calibración",null,null,null,null,null,"Curva de ajuste",null,null,null,null,null,"Resultados de la calibración",null,null,null,null,null,"Curva de ajuste",null,null,null,null,null,"Resultados de la calibración",null,null,null,null,null,"Curva de ajuste"]
[null,null,"Lectura \nPatrón","Lectura \nIBC","Error de \nmedición","U\nExpandida","Deriva","Error","Error \nestimado","Error \nresidual","u\nTotal",null,null,null,"Lectura \nPatrón","Lectura \nIBC","Error de \nmedición","U\nExpandida","Deriva","Error","Error \nestimado","Error \nresidual","u\nTotal",null,null,null,"Lectura \nPatrón","Lectura \nIBC","Error de \nmedición","U\nExpandida","Deriva","Error","Error \nestimado","Error \nresidual","u\nTotal",null,null,null,"Lectura \nPatrón","Lectura \nIBC","Error de \nmedición","U\nExpandida","Deriva","Error","Error \nestimado","Error \nresidual","u\nTotal",null,null,null,"Lectura \nPatrón","Lectura \nIBC","Error de \nmedición","U\nExpandida","Deriva","Error","Error \nestimado","Error \nresidual","U\nTotal",null,null,null,"Lectura \nPatrón","Lectura \nIBC","Error de \nmedición","U\nExpandida","Deriva","Error","Error \nestimado","Error \nresidual","U\nTotal",null,null,null,"Lectura \nPatrón","Lectura \nIBC","Error de \nmedición","U\nExpandida","Deriva","Error","Error \nestimado","Error \nresidual","U\nTotal",null,null,null,"Lectura \nPatrón","Lectura \nIBC","Error de \nmedición","U\nExpandida","Deriva","Error","Error \nestimado","Error \nresidual","U\nTotal",null,null,null,"Lectura \nPatrón","Lectura \nIBC","Error de \nmedición","U\nExpandida","Deriva","Error","Error \nestimado","Error \nresidual","U\nTotal",null,null,null,"Lectura \nPatrón","Lectura \nIBC","Error de \nmedición","U\nExpandida","Deriva","Error","Error \nestimado","Error \nresidual","U\nTotal"]
[null,null,null,null,null,null,null,"Anterior",null,null,null,null,null,null,null,null,null,null,null,"Anterior",null,null,null,null,null,null,null,null,null,null,null,"Anterior",null,null,null,null,null,null,null,null,null,null,null,"Anterior",null,null,null,null,null,null,null,null,null,null,null,"Anterior",null,null,null,null,null,null,null,null,null,null,null,"Anterior",null,null,null,null,null,null,null,null,null,null,null,"Anterior",null,null,null,null,null,null,null,null,null,null,null,"Anterior",null,null,null,null,null,null,null,null,null,null,null,"Anterior",null,null,null,null,null,null,null,null,null,null,null,"Anterior"]
[null,null,"psi","psi","psi","psi","psi","psi","psi","psi","psi",null,null,null,"psi","psi","psi","psi","psi","psi","psi","psi","psi",null,null,null,"psi","psi","psi","psi","psi","psi","psi","psi","psi",null,null,null,"psi","psi","psi","psi","psi","psi","psi","psi","psi",null,null,null,"psi","psi","psi","psi","psi","psi","psi","psi","psi",null,null,null,"psi","psi","psi","psi","psi","psi","psi","psi","psi",null,null,null,"psi","psi","psi","psi","psi","psi","psi","psi","psi",null,null,null,"psi","psi","psi","psi","psi","psi","psi","psi","psi",null,null,null,"psi","psi","psi","psi","psi","psi","psi","psi","psi",null,null,null,"inHg","inHg","inHg","inHg","inHg","inHg","inHg","inHg","inHg"]
[null,null,1.43902,1.4388,{"$f":"D9-C9","v":-0.000219999999999887},0.00054,{"$f":"ABS(E9-H9)","v":0.000219999999999887},0,{"$f":"E38","v":0.000286404319404854},{"$f":"I9-E9","v":0.000506404319404741},{"$f":"SQRT(SUMSQ((F9/2),$J$19))","v":0.0056272788639119},null,null,null,4.9871,4.9875,{"$f":"P9-O9","v":0.000399999999999956},0.0012,{"$f":"ABS(Q9-T9)","v":0.000399999999999956},0,{"$f":"Q37","v":0.000500926608554053},{"$f":"U9-Q9","v":0.000100926608554097},{"$f":"SQRT(SUMSQ((R9/2),$V$19))","v":0.00143724634614649},null,null,null,30,29.97,{"$f":"AB9-AA9","v":-0.0300000000000011},0.0083,{"$f":"ABS(AC9-AF9)","v":0.00800000000000267},-0.0219999999999985,{"$f":"AC36","v":-0.0298225300000041},{"$f":"AG9-AC9","v":0.000177469999997015},{"$f":"SQRT(SUMSQ((AD9/2),$AH$19))","v":0.011435780423444},null,null,null,99.74,99.75,{"$f":"AN9-AM9","v":0.0100000000000051},0.104,{"$f":"ABS(AO9-AR9)","v":0.019999999999996},0.0300000000000011,{"$f":"AO36","v":0.000388924084887776},{"$f":"AS9-AO9","v":-0.00961107591511734},{"$f":"SQRT(SUMSQ((AP9/2),$AT$19))","v":0.135680015091694},null,null,null,296.25,296.2,{"$f":"AZ9-AY9","v":-0.0500000000000114},0.084,{"$f":"ABS(BA9-BD9)","v":0.0300000000000114},-0.02,{"$f":"BA36","v":-0.0534194323376482},{"$f":"BE9-BA9","v":-0.00341943233763686},{"$f":"SQRT(SUMSQ((BB9/2),$BF$19))","v":0.053007365501913},null,null,null,498.66,498.95,{"$f":"BL9-BK9","v":0.289999999999964},0.12,{"$f":"ABS(BM9-BP9)","v":0.389999999999964},-0.1,{"$f":"BM36","v":0.499813507731062},{"$f":"BQ9-BM9","v":0.209813507731099},{"$f":"SQRT(SUMSQ((BN9/2),$BR$19))","v":1.99673317249801},null,null,null,990.53,990.68,{"$f":"BX9-BW9","v":0.149999999999977},0.48,{"$f":"ABS(BY9-CB9)","v":0.149999999999977},0,{"$f":"BY36","v":0.204504716484735},{"$f":"BY9-CC9","v":-0.0545047164847574},{"$f":"SQRT(SUMSQ((BZ9/2),$CB$41))","v":0.553397912181327},null,null,null,3615.6,3616.5,0.94,1.1,{"$f":"ABS(CK9-CN9)","v":0.96},1.9,{"$f":"CK36","v":-0.209999611738112},{"$f":"CO9-CK9","v":-1.14999961173811},{"$f":"SQRT(SUMSQ((CL9/2),$CP$19))","v":10.9699442564802},null,null,null,-1.001542,-1.0157,{"$f":"CV9-CU9","v":-0.0141580000000001},0.0015,{"$f":"ABS(CW9-CZ9)","v":0.0154580000000002},0.00130000000000008,{"$f":"CW36","v":0.0771623220440452},{"$f":"DA9-CW9","v":0.0913203220440453},{"$f":"SQRT(SUMSQ((CX9/2),$DB$19))","v":0.144009860993567},null,null,null,-2,-2.02,{"$f":"DH9-DG9","v":-0.02},0.0066,{"$f":"ABS(DI9-DL9)","v":0.0250000000000004},0.00500000000000034,{"$f":"DI36","v":-0.0259118918399999},{"$f":"DM9-DI9","v":-0.00591189183999985},{"$f":"SQRT(SUMSQ((DJ9/2),$DN$19))","v":0.482358762701944}]
[null,null,2.87792,2.8778,-0.000119999999999898,0.00039,8.000000000008e-5,-0.000199999999999978,{"$f":"E39","v":0.00119186281271766},{"$f":"I10-E10","v":0.00131186281271756},{"$f":"SQRT(SUMSQ((F10/2),$J$19))","v":0.00562417926565553},null,null,null,9.9742,9.9735,{"$f":"P10-O10","v":-0.000700000000000145},0.0012,0.000700000000000145,0,{"$f":"Q38","v":-0.000310887872814192},0.000389112127185953,{"$f":"SQRT(SUMSQ((R10/2),$V$19))","v":0.00143724634614649},null,null,null,60.01,59.98,-0.0300000000000011,0.0167,0.00599999999999312,-0.0359999999999943,{"$f":"AC37","v":-0.0325857663050186},-0.0025857663050175,{"$f":"SQRT(SUMSQ((AD10/2),$AH$19))","v":0.013537986330811},null,null,null,199.46,199.5,0.039999999999992,0.058,0.00999999999999091,0.0300000000000011,{"$f":"AO37","v":0.00302248932723614},-0.0369775106727559,{"$f":"SQRT(SUMSQ((AP10/2),$AT$19))","v":0.128631514393955},null,null,null,592.75,592.6,-0.149999999999977,0.086,0.109999999999977,-0.04,{"$f":"BA37","v":-0.153964789145107},-0.00396478914512954,{"$f":"SQRT(SUMSQ((BB10/2),$BF$19))","v":0.0538031671693535},null,null,null,997.31,997.6,0.290000000000077,0.09,0.440000000000077,-0.15,{"$f":"BM37","v":0.676343195558729},0.386343195558652,{"$f":"SQRT(SUMSQ((BN10/2),$BR$19))","v":1.99633873933107},null,null,null,1988.51,1988.63,0.120000000000118,0.48,0.120000000000118,0,{"$f":"BY37","v":0.19327887995496},{"$f":"BY10-CC10","v":-0.0732788799548416},{"$f":"SQRT(SUMSQ((BZ10/2),$CB$41))","v":0.553397912181327},null,null,null,7229.4,7232,2.57,8.7,1.33,3.9,{"$f":"CK37","v":0.553710228165073},-2.01628977183493,{"$f":"SQRT(SUMSQ((CL10/2),$CP$19))","v":11.7881159219904},null,null,null,-2.01545,-2.0162,-0.000750000000000028,0.0016,0.00185000000000013,0.0011000000000001,{"$f":"CW37","v":0.089090318948476},0.089840318948476,{"$f":"SQRT(SUMSQ((CX10/2),$DB$19))","v":0.144010130072112},null,null,null,-4.001,-4.02,-0.0189999999999992,0.0065,0.00600000000000112,-0.0250000000000004,{"$f":"DI37","v":-0.04197692515576},-0.0229769251557608,{"$f":"SQRT(SUMSQ((DJ10/2),$DN$19))","v":0.482358423224215}]
[null,null,4.49668,4.4971,0.000420000000000087,0.00025,0.000280000000000058,0.000700000000000145,0.0018941404486057,{"$f":"I11-E11","v":0.00147414044860561},0.00562218751130106,null,null,null,14.9613,14.961,-0.000299999999999301,0.001,0.000299999999999301,0,4.88384667285402e-6,0.000304883846672155,0.00139845524043905,null,null,null,90.01,89.96,-0.0500000000000114,0.0134,0.0120000000000147,-0.0379999999999967,-0.0386787949045271,0.0113212050954843,0.0125874768676342,null,null,null,299.17,299.2,0.0299999999999727,0.059,0.0199999999999818,0.00999999999999091,0.00561281463046726,-0.0243871853695055,0.128745161055794,null,null,null,896.47,896.3,-0.170000000000073,0.09,0.130000000000073,-0.04,-0.178366187173992,-0.00836618717391957,{"$f":"SQRT(SUMSQ((BB11/2),$BF$19))","v":0.055414626205122},null,null,null,1489.46,1489.6,0.139999999999873,0.11,0.379999999999873,-0.24,0.770893714835665,0.630893714835793,1.99658918211883,null,null,null,2986.48,2986.38,-0.0999999999999091,0.49,0.0999999999999091,0,0.0923541695838139,-0.192354169583723,0.555584601304474,null,null,null,10844,10848,3.97,10.5,1.63,5.6,-0.0825294605110685,-4.05252946051107,12.1490607451886,null,null,null,-3.01549,-3.0162,-0.00071000000000021,0.0015,0.00181000000000031,0.0011000000000001,0.0916223942032715,0.0923323942032717,0.144009860993567,null,null,null,-6.002,-6.02,-0.0179999999999998,0.0066,0.0110000000000001,-0.0289999999999999,-0.0644471976142711,-0.0464471976142713,0.482358762701944]
[null,null,5.93551,5.93555,4.0000000000262e-5,0.00034,0.000460000000000349,0.000500000000000611,0.00239274733914385,0.00235274733914359,0.00562336797766513,null,null,null,19.9484,19.9485,9.99999999997669e-5,0.0014,0.000900000000000233,0.001,0.000524987534170407,0.00042498753417064,0.00148178171790296,null,null,null,120,119.97,-0.0300000000000011,0.0174,0.0180000000000007,-0.0480000000000018,-0.0471899200000081,-0.017189920000007,0.0137566192755788,null,null,null,398.89,398.95,0.0600000000000023,0.105,0.0300000000000296,0.0299999999999727,0.0058492574654565,-0.0541507425345458,0.13587242728119,null,null,null,1192.97,1192.8,-0.170000000000073,0.095,0.180000000000064,0.00999999999999091,-0.182687422525987,-0.0126874225259144,0.0574632995698419,null,null,null,1988.44,1988.48,0.0399999999999636,0.2,0.449999999999964,-0.41,0.849993104276564,0.8099931042766,1.99833514760511,null,null,null,3984.43,3984.13,-0.299999999999727,0.5,0.299999999999727,0,-0.118821922292682,-0.181178077707045,0.55780753778221,null,null,null,14458.5,14460,1.51,10.7,1.59,3.1,-1.66404807172876,-3.17404807172876,12.1926074729847,null,null,null,-4.01553,-4.01585,-0.00032000000000032,0.0015,0.00152000000000019,0.00119999999999987,0.091183930439763,0.0915039304397633,0.144009860993567,null,null,null,-8.003,-8.005,-0.00200000000000067,0.013,0.0350000000000001,-0.0370000000000008,-0.0948109622167568,-0.0928109622167561,0.482391268531418]
[null,null,7.37434,7.3743,-4.0000000000262e-5,0.00055,0.000359999999999694,-0.000399999999999956,0.00292822867027454,0.0029682286702748,0.00562752098283334,null,null,null,24.9353,24.9355,0.000199999999999534,0.0015,0.000800000000000466,0.001,0.000931798590723787,0.000731798590724253,0.00150604683177896,null,null,null,150,149.94,-0.0600000000000023,0.0138,0.0120000000000005,-0.0720000000000027,-0.057216249999982,0.00278375000002029,0.012695061003919,null,null,null,498.64,498.7,0.0600000000000023,0.062,0.0300000000000296,0.0299999999999727,0.00135146277398235,-0.0586485372260199,0.129097120398877,null,null,null,1489.47,1489.3,-0.170000000000073,0.101,0.180000000000064,0.00999999999999091,-0.190735798919377,-0.0207357989193042,0.0599669141898547,null,null,null,2487.42,2487.33,-0.0900000000001455,0.27,0.479999999999854,-0.57,0.945659871795215,1.03565987179536,2.00039205211227,null,null,null,4982.37,4981.7,-0.670000000000073,0.53,0.670000000000073,0,-0.430470384191722,-0.239529615808351,0.564689515757687,null,null,null,18072.8,18075.5,2.67,10,1.93,4.6,-3.76954573021067,-6.43954573021067,12.0431381703559,null,null,null,-5.01559,-5.0147,0.000890000000000057,0.0015,0.000910000000000188,0.00180000000000025,0.0906848615953093,0.0897948615953092,0.144009860993567,null,null,null,-10.004,-10.01,-0.00600000000000023,0.0068,0.0259999999999998,-0.032,-0.134824805221596,-0.128824805221596,0.482359457205257]
[null,null,8.99295,8.9931,0.00014999999999965,0.00058,0.000949999999999562,-0.000799999999999912,0.00370803566139699,0.00355803566139734,0.00562827392832204,null,null,null,29.9223,29.9225,0.000199999999999534,0.0016,0.000800000000000466,0.001,0.00128259389654772,0.00108259389654819,0.00153156033492365,null,null,null,180,179.92,-0.0800000000000125,0.015,0,-0.0800000000000125,-0.0678464800000143,0.0121535199999983,0.0130309084062941,null,null,null,598.37,598.45,0.0800000000000409,0.107,0.0800000000000409,0,-0.00971011856142923,-0.0897101185614702,0.136261940743857,null,null,null,1793.2,1793,-0.200000000000045,0.109,0.380000000000045,0.18,-0.204530003506761,-0.00453000350671573,0.0633721610603062,null,null,null,2986.4,2986.3,-0.0999999999999091,0.22,0.390000000000091,-0.49,1.06796871301503,1.16796871301494,1.9988605159325,null,null,null,5980.31,5979.25,-1.0600000000004,0.53,1.0600000000004,0,-0.812560126992139,-0.247439873008261,0.564689515757687,null,null,null,21687,21687,-0.01,9.5,0.81,0.8,-6.07931532930888,-6.06931532930888,11.9415106661713,null,null,null,-6.01564,-6.01575,-0.000109999999999388,0.0015,0.00140999999999902,0.00129999999999963,0.0908260932807092,0.0909360932807086,0.144009860993567,null,null,null,-12.006,-12,0.00600000000000023,0.0068,0.00900000000000034,-0.00300000000000011,-0.186268632206732,-0.192268632206732,0.482359457205257]
[null,null,10.43169,10.4324,0.000709999999999766,0.0007,0.000709999999999766,0,0.00457844086640158,0.00386844086640181,0.00563168424294452,null,null,null,34.9097,34.911,0.00130000000000052,0.0017,0.00169999999999948,0.003,0.00177875393046634,0.000478753930465814,0.00155826090867718,null,null,null,209.99,209.92,-0.0700000000000216,0.016,0.0129999999999768,-0.0829999999999984,-0.0781684999625725,-0.00816849996255087,0.0133249605587869,null,null,null,698.09,698.15,0.0599999999999454,0.109,0.0299999999999727,0.0299999999999727,-0.0280027088783754,-0.0880027088783208,0.13665766167794,null,null,null,2089.69,2089.5,-0.190000000000055,0.119,0.2800000000002,0.0900000000001455,-0.216013885593384,-0.0260138855933292,0.067720239201094,null,null,null,3485.37,3485.13,-0.239999999999782,0.2,0.460000000000218,-0.7,1.21109279387838,1.45109279387816,1.99833514760511,null,null,null,6978.23,6976.53,-1.69999999999982,0.62,1.69999999999982,0,-1.22486907657731,-0.475130923422512,0.587153514173807,null,null,null,25301.1,25301.5,0.44,9,2.26,2.7,-8.44268152167933,-8.88268152167933,11.8442887920838,null,null,null,-7.01569,-7.0163,-0.000609999999999999,0.0015,0.00180999999999987,0.00119999999999987,0.0911364310311438,0.0917464310311438,0.144009860993567,null,null,null,-14.007,-13.99,0.0169999999999995,0.0067,0.00399999999999956,0.0129999999999999,-0.250563330567626,-0.267563330567626,0.482359107362296]
[null,null,11.87043,11.8713,0.000869999999999038,0.00084,0.000370000000000203,0.000499999999998835,0.00549125299262343,0.00462125299262439,0.00563646763604916,null,null,null,39.8967,39.898,0.00130000000000052,0.0019,0.00269999999999948,0.004,0.00253487669488095,0.00123487669488043,0.00161498515767528,null,null,null,239.99,239.9,-0.0900000000000034,0.0161,0.0149999999999864,-0.10499999999999,-0.0872806259620802,0.00271937403792322,0.013355039269625,null,null,null,797.82,797.85,0.0299999999999727,0.11,0.00999999999999091,0.0399999999999636,-0.0524234024003363,-0.082423402400309,0.13685783315281,null,null,null,2386.19,2386,-0.190000000000055,0.138,0.290000000000418,0.100000000000364,-0.221540114196159,-0.0315401141961047,0.076202236170951,null,null,null,3984.34,3984.05,-0.289999999999964,0.22,0.520000000000036,-0.81,1.36104094529082,1.65104094529079,1.9988605159325,null,null,null,8097,8095.05,-1.94999999999982,0.8,1.94999999999982,0,-1.67348311363003,-0.276516886369791,0.639256794415712,null,null,null,28915,28911.5,-3.46,7.9,2.66,-0.8,-10.9455335917846,-7.48553359178462,11.646444821931,null,null,null,-8.01573,-8.0162,-0.00046999999999997,0.0015,0.000970000000000582,0.000500000000000611,0.0910096800224531,0.0914796800224531,0.144009860993567,null,null,null,-16.008,-16,0.00799999999999912,0.0066,0.011000000000001,0.0190000000000001,-0.32864991350008,-0.336649913500079,0.482358762701944]
[null,null,13.48894,13.4898,0.000860000000001193,0.001,0.00106000000000073,-0.000199999999999534,0.00618154634136658,0.00532154634136539,0.00564299277088227,null,null,null,44.8838,44.886,0.00220000000000198,0.002,0.00279999999999802,0.005,0.00334823992901789,0.00114823992901592,0.00164489423961282,null,null,null,269.99,269.9,-0.0900000000000318,0.0189,0.0229999999999677,-0.113,-0.0942704949015933,-0.00427049490156151,0.0142427902425482,null,null,null,897.55,897.6,0.0500000000000682,0.072,0.0200000000000955,0.0299999999999727,-0.0794743111006255,-0.129474311100694,0.130388137862623,null,null,null,2689.91,2689.7,-0.210000000000036,0.159,0.2800000000002,0.0700000000001637,-0.23316188454055,-0.0231618845405137,0.0858255835835294,null,null,null,4483.3,4483,-0.300000000000182,0.27,0.509999999999818,-0.81,1.50337482303621,1.80337482303639,2.00039205211227,null,null,null,9109.13,9106.58,-2.54999999999927,0.9,2.54999999999927,0,-2.03384562584324,-0.516154374156031,0.671676446815467,null,null,null,32528.7,32525.5,-3.23,7.2,2.53,-0.7,-13.9779494954382,-10.7479494954382,11.5324402010278,null,null,null,-9.01574,-9.01545,0.000289999999999679,0.0014,0.00150999999999968,0.00179999999999936,0.0907416686187297,0.09045166861873,0.144009609274474,null,null,null,-19.009,-19,0.00900000000000034,0.0067,0.00100000000000122,0.0100000000000016,-0.471519327370338,-0.480519327370338,0.482359107362296]
[null,null,14.38813,14.38875,0.000619999999999621,0.0011,0.00032000000000032,0.000299999999999301,0.00614972526821589,0.00552972526821627,0.00564764264204363,null,null,null,49.8708,49.873,0.00219999999999487,0.0021,0.00280000000000513,0.005,0.00346784297597225,0.00126784297597737,0.00167576163564853,null,null,null,300,299.9,-0.100000000000023,0.016,0.00999999999999091,-0.110000000000014,-0.0982300000000009,0.00177000000002181,0.0133249605587869,null,null,null,997.28,997.3,0.0199999999999818,0.076,0.0600000000000591,-0.0400000000000773,-0.102655092103078,-0.122655092103059,0.130954444351012,null,null,null,3000.86,3000.6,-0.260000000000218,0.18,0.370000000000346,0.110000000000127,-0.295584815721668,-0.0355848157214496,0.0956335756805809,null,null,null,4982.26,4981.85,-0.409999999999854,0.27,0.410000000000145,-0.82,1.63094718965931,2.04094718965916,2.00039205211227,null,null,null,9976.66,9973.88,-2.78000000000065,1.08,2.78000000000065,0,-2.30124790584523,-0.478752094155425,0.735016495873835,null,null,null,36142.4,36135,-7.37,6.7,3.37,-4,-18.3018437564897,-10.9318437564897,11.4568615680859,null,null,null,-10.01572,-10.0145,0.00122,0.0015,0.00178000000000011,0.00300000000000011,0.0925668760898102,0.0913468760898102,0.144009860993567,null,null,null,-22.51,-22.51,0,0.0062,0.0189999999999984,-0.0189999999999984,-0.670758567534786,-0.670758567534786,0.482357435886864]
[null,null,null,null,null,null,null,"Error Típico",null,{"$f":"SQRT(SUMSQ(J9:J18)/(10-F26-1))","v":0.00562079775585544},null,null,null,null,null,null,null,null,null,"Error Típico",null,{"$f":"SQRT((T39)/(COUNT(O9:O18)-T22-1))","v":0.00130601571947333},null,null,null,null,null,null,null,null,null,"Error Típico",null,{"$f":"SQRT(SUMSQ(AH9:AH18)/(10-AF22-1))","v":0.0106561988482397},null,null,null,null,null,null,null,null,null,"Error Típico",null,{"$f":"SQRT(SUMSQ(AT9:AT18)/(10-AR22-1))","v":0.125319856747773},null,null,null,null,null,null,null,null,null,"Error Típico",null,{"$f":"SQRT(SUMSQ(BF9:BF18)/(10-BD22-1))","v":0.0323385342502315},null,null,null,null,null,null,null,null,null,"Error Típico",null,{"$f":"SQRT(SUMSQ(BR9:BR18)/(10-BQ22-1))","v":1.99583149643299},null,null,null,null,null,null,null,null,null,"Error Típico",null,{"$f":"SQRT(SUMSQ(CD9:CD18)/(10-CC22-1))","v":0.498647419733273},null,null,null,null,null,null,null,null,null,"Error Típico",null,{"$f":"SQRT(SUMSQ(CP9:CP18)/(10-CO22-1))","v":10.9561479083792},null,null,null,null,null,null,null,null,null,"Error Típico",null,{"$f":"SQRT(SUMSQ(DB9:DB18)/(10-DA21-1))","v":0.144007907989064},null,null,null,null,null,null,null,null,null,"Error Típico",null,{"$f":"SQRT(SUMSQ(DN9:DN18)/(10-DL21-1))","v":0.48234747429146}]
[]
[null,null,null,null,null,null,null,null,null,null,null,null,null,null,null,null,null,null,null,null,null,null,null,null,null,null,null,null,null,null,null,null,null,null,null,null,null,null,null,null,null,null,null,null,null,null,null,null,null,null,null,null,null,null,null,null,null,null,null,null,null,null,null,null,null,null,null,null,null,null,null,null,null,null,null,null,null,null,null,null,null,null,null,null,null,null,null,null,null,null,null,null,null,null,null,null,null,null,null,null,null,"Especificación",null,null,{"$f":"5-COUNTIF(COEFICIENTES_Fluke_Menos_15,0)","v":5},null,null,null,null,null,null,null,null,"Especificación",null,{"$f":"5-COUNTIF(DM22:DM27,0)","v":5}]
[null,null,null,null,null,null,null,null,null,null,null,null,null,null,null,null,null,"Especificación",null,{"$f":"5-COUNTIF(COEFICIENTES_50,0)","v":5},null,null,null,null,null,null,null,null,null,"Especificación",null,{"$f":"5-COUNTIF(COEFICIENTES_300,0)","v":3},null,null,null,null,null,null,null,null,null,"Especificación",null,{"$f":"5-COUNTIF(COEFICIENTES_1000,0)","v":5},null,null,null,null,null,null,null,null,"Especificación",null,null,{"$f":"5-COUNTIF(COEFICIENTES_3000,0)","v":5},null,null,null,null,null,null,null,null,null,"Especificación",null,null,{"$f":"5-COUNTIF(COEFICIENTES_5000,0)","v":5},null,null,null,null,null,null,null,null,"Especificación",null,null,{"$f":"5-COUNTIF(COEFICIENTES_10000,0)","v":5},null,null,null,null,null,null,null,null,"Especificación",null,null,{"$f":"5-COUNTIF(COEFICIENTES_36000,0)","v":5},null,null,null,null,null,null,null,null,{"$f":"0.05%*-15","v":-0.0075},null,null,"a0 (intercepto)",0.0455,null,null,null,null,null,null,null,{"$f":"0.1%*-22.5","v":-0.0225},null,"a0 (intercepto)",-0.01531]
[null,null,null,null,null,null,null,null,null,null,null,null,null,null,null,null,null,{"$f":"0.025%*50","v":0.0125},null,"a0 (intercepto)",0.0042,null,null,null,null,null,null,null,null,{"$f":"0.5%*300","v":1.5},null,"a0 (intercepto)",-0.0313,null,null,null,null,null,null,null,null,{"$f":"0.025%*1000","v":0.25},null,"a0 (intercepto)",-0.0006565,null,null,null,null,null,null,null,{"$f":"0.025%*3000","v":0.75},null,null,"a0 (intercepto)",0.2249,null,null,null,null,null,null,null,null,{"$f":"0.025%*5000","v":1.25},null,null,"a0 (intercepto)",0.139,null,null,null,null,null,null,null,{"$f":"0.02%*10000","v":2},null,null,"a0 (intercepto)",0.187,null,null,null,null,null,null,null,{"$f":"0.1%*36000","v":36},null,null,"a0 (intercepto)",-2.796,null,null,null,null,null,null,null,{"$f":"-CX22","v":0.0075},null,null,"a1",0.9537,null,null,null,null,null,null,null,{"$f":"-DJ22","v":0.0225},null,"a1",1.004]
[null,null,null,null,null,null,null,null,null,null,null,null,null,null,null,null,null,{"$f":"-R23","v":-0.0125},null,"a1",0.9988,null,null,null,null,null,null,null,null,{"$f":"-AD23","v":-1.5},null,"a1",1.00013,null,null,null,null,null,null,null,null,{"$f":"-AP23","v":-0.25},null,"a1",1,null,null,null,null,null,null,null,{"$f":"-BA23","v":-0.75},null,null,"a1",0.9986,null,null,null,null,null,null,null,null,{"$f":"-BN23","v":-1.25},null,null,"a1",1.001,null,null,null,null,null,null,null,{"$f":"-BZ23","v":-2},null,null,"a1",1,null,null,null,null,null,null,null,{"$f":"-CL23","v":-36},null,null,"a1",1.001,null,null,null,null,null,null,null,null,null,null,"a2",-0.01754,null,null,null,null,null,null,null,null,null,"a2",-0.0006541]
[null,null,null,null,null,null,null,null,null,null,null,null,null,null,null,null,null,null,null,"a2",0.0001127,null,null,null,null,null,null,null,null,null,null,"a2",-2.86e-6,null,null,null,null,null,null,null,null,null,null,"a2",1.048e-7,null,null,null,null,null,null,null,null,null,null,"a2",1.884e-6,null,null,null,null,null,null,null,null,null,null,null,"a2",-6.629e-7,null,null,null,null,null,null,null,null,null,null,"a2",3.848e-8,null,null,null,null,null,null,null,null,null,null,"a2",-8.247e-8,null,null,null,null,null,null,null,null,null,null,"a3",-0.003129,null,null,null,null,null,null,null,null,null,"a3",-7.193e-6]
[null,null,null,"Especificación",null,{"$f":"5-COUNTIF(COEFICIENTES_15,0)","v":5},null,null,null,null,null,null,null,null,null,null,null,null,null,"a3",-4.593e-6,null,null,null,null,null,null,null,null,null,null,"a3",5.61e-9,null,null,null,null,null,null,null,null,null,null,"a3",7.791e-11,null,null,null,null,null,null,null,null,null,null,"a3",-1.219e-9,null,null,null,null,null,null,null,null,null,null,null,"a3",2.354e-10,null,null,null,null,null,null,null,null,null,null,"a3",-2.327e-11,null,null,null,null,null,null,null,null,null,null,"a3",8.886e-13,null,null,null,null,null,null,null,null,null,null,"a4",-0.0002655,null,null,null,null,null,null,null,null,null,"a4",-2.832e-6]
[null,null,null,{"$f":"0.025%*15","v":0.00375},null,"a0 (intercepto)",-0.0009719,null,null,null,null,null,null,null,null,null,null,null,null,"a4",8.743e-8,null,null,null,null,null,null,null,null,null,null,"a4",0,null,null,null,null,null,null,null,null,null,null,"a4",-8.039e-13,null,null,null,null,null,null,null,null,null,null,"a4",3.735e-13,null,null,null,null,null,null,null,null,null,null,null,"a4",-3.658e-14,null,null,null,null,null,null,null,null,null,null,"a4",2.541e-15,null,null,null,null,null,null,null,null,null,null,"a4",4.131e-17,null,null,null,null,null,null,null,null,null,null,"a5",-8.64e-6,null,null,null,null,null,null,null,null,null,"a5",-7.113e-8]
[null,null,null,{"$f":"-D27","v":-0.00375},null,"a1",1.001,null,null,null,null,null,null,null,null,null,null,null,null,"a5",-6.234e-10,null,null,null,null,null,null,null,null,null,null,"a5",0,null,null,null,null,null,null,null,null,null,null,"a5",5.187e-16,null,null,null,null,null,null,null,null,null,null,"a5",-4.369e-17,null,null,null,null,null,null,null,null,null,null,null,"a5",2.082e-18,null,null,null,null,null,null,null,null,null,null,"a5",-8.483e-20,null,null,null,null,null,null,null,null,null,null,"a5",-9.139e-22]
[null,null,null,null,null,"a2",-8.349e-5]
[null,null,null,null,null,"a3",-4.555e-6]
[null,null,null,null,null,"a4",1.428e-6]
[null,null,null,null,null,"a5",-6.1e-8]
[null,null,null,null,null,null,null,null,null,null,null,null,null,null,null,null,null,null,null,null,null,null,null,null,null,null,null,"Valor Nominal","Error","Residual",null,null,null,null,null,null,null,null,null,"Valor Nominal","Error","Residual",null,null,null,null,null,null,null,null,null,"Valor Nominal","Error","Residual",null,null,null,null,null,null,null,null,null,"Valor Nominal","Error","Residual",null,null,null,null,null,null,null,null,null,"Valor Nominal","Error","Residual",null,null,null,null,null,null,null,null,null,"Valor Nominal","Error","Residual",null,null,null,null,null,null,null,null,null,"Valor Nominal","Error","Residual",null,null,null,null,null,null,null,null,null,"Valor Nominal","Error","Residual"]
[null,null,null,null,null,null,null,null,null,null,null,null,null,null,null,"Valor Nominal","Error","Residual"]
[null,null,null,"Valor Nominal","Error","Residual",null,null,null,null,null,null,null,null,null,null,null,null,null,null,null,null,null,null,null,null,null,"psi","psi","psi",null,null,null,null,null,null,null,null,null,"psi","psi","psi",null,null,null,null,null,null,null,null,null,"psi","psi","psi",null,null,null,null,null,null,null,null,null,"psi","psi","psi",null,null,null,null,null,null,null,null,null,"psi","psi","psi",null,null,null,null,null,null,null,null,null,"psi","psi","psi",null,null,null,null,null,null,null,null,null,"psi","psi","psi",null,null,null,null,null,null,null,null,null,"psi","psi","psi"]
[null,null,null,null,null,null,null,null,null,null,null,null,null,null,null,"psi","psi","psi",null,null,null,null,null,null,null,null,null,{"$f":"($AG$28*AA9^5+$AG$27*AA9^4+$AG$26*AA9^3+$AG$25*AA9^2+$AG$24*AA9+$AG$23)","v":29.97017747},{"$f":"AB36-AA9","v":-0.0298225300000041},{"$f":"AC9-AC36","v":-0.000177469999997015},null,null,null,null,null,null,null,null,null,{"$f":"($AS$28*AM9^5+$AS$27*AM9^4+$AS$26*AM9^3+$AS$25*AM9^2+$AS$24*AM9+$AS$23)","v":99.7403889240849},{"$f":"AN36-AM9","v":0.000388924084887776},{"$f":"AO9-AO36","v":0.00961107591511734},null,null,null,null,null,null,null,null,null,{"$f":"($BE$28*AY9^5+$BE$27*AY9^4+$BE$26*AY9^3+$BE$25*AY9^2+$BE$24*AY9+$BE$23)","v":296.196580567662},{"$f":"AZ36-AY9","v":-0.0534194323376482},{"$f":"BA9-BA36","v":0.00341943233763686},null,null,null,null,null,null,null,null,null,{"$f":"($BR$28*BK9^5+$BR$27*BK9^4+$BR$26*BK9^3+$BR$25*BK9^2+$BR$24*BK9+$BR$23)","v":499.159813507731},{"$f":"BL36-BK9","v":0.499813507731062},{"$f":"BM9-BM36","v":-0.209813507731099},null,null,null,null,null,null,null,null,null,{"$f":"($CD$28*BW9^5+$CD$27*BW9^4+$CD$26*BW9^3+$CD$25*BW9^2+$CD$24*BW9+$CD$23)","v":990.734504716485},{"$f":"BX36-BW9","v":0.204504716484735},{"$f":"BY9-BY36","v":-0.0545047164847574},null,null,null,null,null,null,null,null,null,{"$f":"($CP$28*CI9^5+$CP$27*CI9^4+$CP$26*CI9^3+$CP$25*CI9^2+$CP$24*CI9+$CP$23)","v":3615.39000038826},{"$f":"CJ36-CI9","v":-0.209999611738112},{"$f":"CK9-CK36","v":1.14999961173811},null,null,null,null,null,null,null,null,null,{"$f":"($DB$27*CU9^5+$DB$26*CU9^4+$DB$25*CU9^3+$DB$24*CU9^2+$DB$23*CU9+$DB$22)","v":-0.924379677955955},{"$f":"CV36-CU9","v":0.0771623220440452},{"$f":"CW9-CW36","v":-0.0913203220440453},null,null,null,null,null,null,null,null,null,{"$f":"($DM$27*DG9^5+$DM$26*DG9^4+$DM$25*DG9^3+$DM$24*DG9^2+$DM$23*DG9+$DM$22)","v":-2.02591189184},{"$f":"DH36-DG9","v":-0.0259118918399999},{"$f":"DI9-DI36","v":0.00591189183999985}]
[null,null,null,"psi","psi","psi",null,null,null,null,null,null,null,null,null,{"$f":"($U$28*O9^5+$U$27*O9^4+$U$26*O9^3+$U$25*O9^2+$U$24*O9+$U$23)","v":4.98760092660855},{"$f":"P37-O9","v":0.000500926608554053},{"$f":"Q9-Q37","v":-0.000100926608554097},null,null,null,null,null,null,null,null,null,{"$f":"($AG$28*AA10^5+$AG$27*AA10^4+$AG$26*AA10^3+$AG$25*AA10^2+$AG$24*AA10+$AG$23)","v":59.977414233695},{"$f":"AB37-AA10","v":-0.0325857663050186},{"$f":"AC10-AC37","v":0.0025857663050175},null,"Suma",null,null,null,null,null,null,null,{"$f":"($AS$28*AM10^5+$AS$27*AM10^4+$AS$26*AM10^3+$AS$25*AM10^2+$AS$24*AM10+$AS$23)","v":199.463022489327},{"$f":"AN37-AM10","v":0.00302248932723614},{"$f":"AO10-AO37","v":0.0369775106727559},null,"Suma",null,null,null,null,null,null,null,{"$f":"($BE$28*AY10^5+$BE$27*AY10^4+$BE$26*AY10^3+$BE$25*AY10^2+$BE$24*AY10+$BE$23)","v":592.596035210855},{"$f":"AZ37-AY10","v":-0.153964789145107},{"$f":"BA10-BA37","v":0.00396478914512954},null,"Suma",null,null,null,null,null,null,null,{"$f":"($BR$28*BK10^5+$BR$27*BK10^4+$BR$26*BK10^3+$BR$25*BK10^2+$BR$24*BK10+$BR$23)","v":997.986343195559},{"$f":"BL37-BK10","v":0.676343195558729},{"$f":"BM10-BM37","v":-0.386343195558652},null,"Suma",null,null,null,null,null,null,null,1988.70327887995,{"$f":"BX37-BW10","v":0.19327887995496},{"$f":"BY10-BY37","v":-0.0732788799548416},null,"Suma",null,null,null,null,null,null,null,{"$f":"($CP$28*CI10^5+$CP$27*CI10^4+$CP$26*CI10^3+$CP$25*CI10^2+$CP$24*CI10+$CP$23)","v":7229.95371022816},{"$f":"CJ37-CI10","v":0.553710228165073},{"$f":"CK10-CK37","v":2.01628977183493},null,"Suma",null,null,null,null,null,null,null,{"$f":"($DB$27*CU10^5+$DB$26*CU10^4+$DB$25*CU10^3+$DB$24*CU10^2+$DB$23*CU10+$DB$22)","v":-1.92635968105152},{"$f":"CV37-CU10","v":0.089090318948476},{"$f":"CW10-CW37","v":-0.089840318948476},null,"Suma",null,null,null,null,null,null,null,{"$f":"($DM$27*DG10^5+$DM$26*DG10^4+$DM$25*DG10^3+$DM$24*DG10^2+$DM$23*DG10+$DM$22)","v":-4.04297692515576},{"$f":"DH37-DG10","v":-0.04197692515576},{"$f":"DI10-DI37","v":0.0229769251557608},null,"Suma"]
[null,null,null,{"$f":"($G$32*C9^5+$G$31*C9^4+$G$30*C9^3+$G$29*C9^2+$G$28*C9+$G$27)","v":1.4393064043194},{"$f":"D38-C9","v":0.000286404319404854},{"$f":"E9-E38","v":-0.000506404319404741},null,null,null,null,null,null,null,null,null,{"$f":"($U$28*O10^5+$U$27*O10^4+$U$26*O10^3+$U$25*O10^2+$U$24*O10+$U$23)","v":9.97388911212719},{"$f":"P38-O10","v":-0.000310887872814192},{"$f":"Q10-Q38","v":-0.000389112127185953},null,"Suma",null,null,null,null,null,null,null,89.9713212050955,-0.0386787949045271,-0.0113212050954843,null,{"$f":"SUMSQ(AD36:AD45)","v":0.000681327443359356},null,null,null,null,null,null,null,299.17561281463,0.00561281463046726,0.0243871853695055,null,{"$f":"SUMSQ(AP36:AP45)","v":0.062820265981129},null,null,null,null,null,null,null,896.291633812826,-0.178366187173992,0.00836618717391957,null,{"$f":"SUMSQ(BB36:BB45)","v":0.00418312318981358},null,null,null,null,null,null,null,1490.23089371484,0.770893714835665,-0.630893714835793,null,{"$f":"SUMSQ(BN36:BN45)","v":15.9333734486158},null,null,null,null,null,null,null,2986.57235416958,0.0923541695838139,-0.192354169583723,null,{"$f":"SUMSQ(BZ36:BZ45)","v":0.994596996826606},null,null,null,null,null,null,null,10843.9174705395,-0.0825294605110685,4.05252946051107,null,{"$f":"SUMSQ(CL36:CL45)","v":480.14870796113},null,null,null,null,null,null,null,-2.92386760579673,0.0916223942032715,-0.0923323942032717,null,{"$f":"SUMSQ(CX36:CX45)","v":0.0829531102535464},null,null,null,null,null,null,null,-6.06644719761427,-0.0644471976142711,0.0464471976142713,null,{"$f":"SUMSQ(DJ36:DJ45)","v":0.930636343821402}]
[null,null,null,{"$f":"($G$32*C10^5+$G$31*C10^4+$G$30*C10^3+$G$29*C10^2+$G$28*C10+$G$27)","v":2.87911186281272},{"$f":"D39-C10","v":0.00119186281271766},{"$f":"E10-E39","v":-0.00131186281271756},null,"Suma",null,null,null,null,null,null,null,14.9613048838467,4.88384667285402e-6,-0.000304883846672155,null,{"$f":"SUMSQ(R37:R46)","v":6.82270823804576e-6},null,null,null,null,null,null,null,119.95281008,-0.0471899200000081,0.017189920000007,null,null,null,null,null,null,null,null,null,398.895849257465,0.0058492574654565,0.0541507425345458,null,null,null,null,null,null,null,null,null,1192.78731257747,-0.182687422525987,0.0126874225259144,null,null,null,null,null,null,null,null,null,1989.28999310428,0.849993104276564,-0.8099931042766,null,null,null,null,null,null,null,null,null,3984.31117807771,-0.118821922292682,-0.181178077707045,null,null,null,null,null,null,null,null,null,14456.8359519283,-1.66404807172876,3.17404807172876,null,null,null,null,null,null,null,null,null,-3.92434606956024,0.091183930439763,-0.0915039304397633,null,null,null,null,null,null,null,null,null,-8.09781096221676,-0.0948109622167568,0.0928109622167561]
[null,null,null,4.49857414044861,0.0018941404486057,-0.00147414044860561,null,{"$f":"SUMSQ(F38:F47)","v":0.000126373469648918},null,null,null,null,null,null,null,19.9489249875342,0.000524987534170407,-0.00042498753417064,null,null,null,null,null,null,null,null,null,149.94278375,-0.057216249999982,-0.00278375000002029,null,"u pol",null,null,null,null,null,null,null,498.641351462774,0.00135146277398235,0.0586485372260199,null,"u pol",null,null,null,null,null,null,null,1489.27926420108,-0.190735798919377,0.0207357989193042,null,"u pol",null,null,null,null,null,null,null,2488.3656598718,0.945659871795215,-1.03565987179536,null,"u pol",null,null,null,null,null,null,null,4981.93952961581,-0.430470384191722,-0.239529615808351,null,"u pol",null,null,null,null,null,null,null,18069.0304542698,-3.76954573021067,6.43954573021067,null,"u pol",null,null,null,null,null,null,null,-4.92490513840469,0.0906848615953093,-0.0897948615953092,null,"u pol",null,null,null,null,null,null,null,-10.1388248052216,-0.134824805221596,0.128824805221596,null,"u pol"]
[null,null,null,5.93790274733914,0.00239274733914385,-0.00235274733914359,null,null,null,null,null,null,null,null,null,24.9362317985907,0.000931798590723787,-0.000731798590724253,null,"u pol",null,null,null,null,null,null,null,179.93215352,-0.0678464800000143,-0.0121535199999983,null,{"$f":"SQRT((AF38)/(COUNT(AA7:AA16)-AD24-1))","v":0.0089529978111794},null,null,null,null,null,null,null,598.360289881439,-0.00971011856142923,0.0897101185614702,null,{"$f":"SQRT((AR38)/(COUNT(AM7:AM16)-AP24-1))","v":0.0930852527163094},null,null,null,null,null,null,null,1792.99546999649,-0.204530003506761,0.00453000350671573,null,{"$f":"SQRT((BD38)/(COUNT(AY7:AY16)-BB24-1))","v":0.0244456341115592},null,null,null,null,null,null,null,2987.46796871302,1.06796871301503,-1.16796871301494,null,{"$f":"SQRT((BP38)/(COUNT(BK7:BK16)-BN24-1))","v":1.38971867432643},null,null,null,null,null,null,null,5979.49743987301,-0.812560126992139,-0.247439873008261,null,{"$f":"SQRT((CB38)/(COUNT(BW9:BW18)-CC22-1))","v":0.498647419733273},null,null,null,null,null,null,null,21680.9206846707,-6.07931532930888,6.06931532930888,null,{"$f":"SQRT((CN38)/(COUNT(CI9:CI18)-CO22-1))","v":10.9561479083792},null,null,null,null,null,null,null,-5.92481390671929,0.0908260932807092,-0.0909360932807086,null,{"$f":"SQRT((CZ38)/(COUNT(CU9:CU18)-DA21-1))","v":0.144007907989064},null,null,null,null,null,null,null,-12.1922686322067,-0.186268632206732,0.192268632206732,null,{"$f":"SQRT((DL38)/(COUNT(DG9:DG18)-DL21-1))","v":0.48234747429146}]
[null,null,null,7.37726822867027,0.00292822867027454,-0.0029682286702748,null,"u pol",null,null,null,null,null,null,null,29.9235825938965,0.00128259389654772,-0.00108259389654819,null,{"$f":"SQRT((T39)/(COUNT(O8:O17)-R25-1))","v":0.00092349257157582},null,null,null,null,null,null,null,209.911831500037,-0.0781684999625725,0.00816849996255087,null,null,null,null,null,null,null,null,null,698.061997291122,-0.0280027088783754,0.0880027088783208,null,null,null,null,null,null,null,null,null,2089.47398611441,-0.216013885593384,0.0260138855933292,null,null,null,null,null,null,null,null,null,3486.58109279388,1.21109279387838,-1.45109279387816,null,null,null,null,null,null,null,null,null,6977.00513092342,-1.22486907657731,-0.475130923422512,null,null,null,null,null,null,null,null,null,25292.6573184783,-8.44268152167933,8.88268152167933,null,null,null,null,null,null,null,null,null,-6.92455356896886,0.0911364310311438,-0.0917464310311438,null,null,null,null,null,null,null,null,null,-14.2575633305676,-0.250563330567626,0.267563330567626]
[null,null,null,8.9966580356614,0.00370803566139699,-0.00355803566139734,null,{"$f":"SQRT((H40)/(COUNT(C9:C18)-F26-1))","v":0.00562079775585544},null,null,null,null,null,null,null,34.9114787539305,0.00177875393046634,-0.000478753930465814,null,null,null,null,null,null,null,null,null,239.902719374038,-0.0872806259620802,-0.00271937403792322,null,null,null,null,null,null,null,null,null,797.7675765976,-0.0524234024003363,0.082423402400309,null,null,null,null,null,null,null,null,null,2385.9684598858,-0.221540114196159,0.0315401141961047,null,null,null,null,null,null,null,null,null,3985.70104094529,1.36104094529082,-1.65104094529079,null,null,null,null,null,null,null,null,null,8095.32651688637,-1.67348311363003,-0.276516886369791,null,null,null,null,null,null,null,null,null,28904.0544664082,-10.9455335917846,7.48553359178462,null,null,null,null,null,null,null,null,null,-7.92472031997755,0.0910096800224531,-0.0914796800224531,null,null,null,null,null,null,null,null,null,-16.3366499135001,-0.32864991350008,0.336649913500079]
[null,null,null,10.4362684408664,0.00457844086640158,-0.00386844086640181,null,null,null,null,null,null,null,null,null,39.8992348766949,0.00253487669488095,-0.00123487669488043,null,null,null,null,null,null,null,null,null,269.895729505098,-0.0942704949015933,0.00427049490156151,null,null,null,null,null,null,null,null,null,897.470525688899,-0.0794743111006255,0.129474311100694,null,null,null,null,null,null,null,null,null,2689.67683811546,-0.23316188454055,0.0231618845405137,null,null,null,null,null,null,null,null,null,4484.80337482304,1.50337482303621,-1.80337482303639,null,null,null,null,null,null,null,null,null,9107.09615437416,-2.03384562584324,-0.516154374156031,null,null,null,null,null,null,null,null,null,32514.7220505046,-13.9779494954382,10.7479494954382,null,null,null,null,null,null,null,null,null,-8.92499833138127,0.0907416686187297,-0.09045166861873,null,null,null,null,null,null,null,null,null,-19.4805193273703,-0.471519327370338,0.480519327370338]
[null,null,null,11.8759212529926,0.00549125299262343,-0.00462125299262439,null,null,null,null,null,null,null,null,null,44.887148239929,0.00334823992901789,-0.00114823992901592,null,null,null,null,null,null,null,null,null,299.90177,-0.0982300000000009,-0.00177000000002181,null,null,null,null,null,null,null,null,null,997.177344907897,-0.102655092103078,0.122655092103059,null,null,null,null,null,null,null,null,null,3000.56441518428,-0.295584815721668,0.0355848157214496,null,null,null,null,null,null,null,null,null,4983.89094718966,1.63094718965931,-2.04094718965916,null,null,null,null,null,null,null,null,null,9974.35875209415,-2.30124790584523,-0.478752094155425,null,null,null,null,null,null,null,null,null,36124.0981562435,-18.3018437564897,10.9318437564897,null,null,null,null,null,null,null,null,null,-9.92315312391019,0.0925668760898102,-0.0913468760898102,null,null,null,null,null,null,null,null,null,-23.1807585675348,-0.670758567534786,0.670758567534786]
[null,null,null,13.4951215463414,0.00618154634136658,-0.00532154634136539,null,null,null,null,null,null,null,null,null,49.874267842976,0.00346784297597225,-0.00126784297597737]
[null,null,null,14.3942797252682,0.00614972526821589,-0.00552972526821627]
[]
[]
[]
[]
[]
[]
[null,null,null,null,null,null,null,null,null,null,null,null,null,null,null,null,null,null,null,null,null,null,null,null,null,null,null,null,null,null,null,null,null,null,null,null,null,null,null,null,null,null,null,null,null,null,null,null,null,null,null,null,null,null,null,null,null,null,null,null,null,null,null,null,null,null,null,null,null,null,null,null,null,null,"Y","X","X2","X3",null,"X4","X5"]
[null,null,null,null,null,null,null,null,null,null,null,null,null,null,null,null,null,null,null,null,null,null,null,null,null,null,null,null,null,null,null,null,null,null,null,null,null,null,null,null,null,null,null,null,null,null,null,null,null,null,null,null,null,null,null,null,null,null,null,null,null,null,null,null,null,null,null,null,null,null,null,null,null,null,{"$f":"BY9","v":0.149999999999977},{"$f":"BX9","v":990.68},{"$f":"BX55^2","v":981446.8624},{"$f":"BX55^3","v":972299777.642432},null,{"$f":"BX55^4","v":963237943714.804},{"$f":"BX55^5","v":954260566079382}]
[null,null,null,null,null,null,null,null,null,null,null,null,null,null,null,null,null,null,null,null,null,null,null,null,null,null,null,null,null,null,null,null,null,null,null,null,null,null,null,null,null,null,null,null,null,null,null,null,null,null,null,null,null,null,null,null,null,null,null,null,null,null,null,null,null,null,null,null,null,null,null,null,null,null,0.120000000000118,1988.63,{"$f":"BX56^2","v":3954649.2769},7864334191.52165,null,15639250903285.7,3.1100683523801e+16]
[null,null,null,null,null,null,null,null,null,null,null,null,null,null,null,null,null,null,null,null,null,null,null,null,null,null,null,null,null,null,null,null,null,null,null,null,null,null,null,null,null,null,null,null,null,null,null,null,null,null,null,null,null,null,null,null,null,null,null,null,null,null,null,null,null,null,null,null,null,null,null,null,null,null,-0.0999999999999091,2986.38,8918465.5044,26633927013.0301,null,79539026953172.7,2.37533759312416e+17]
[null,null,null,null,null,null,null,null,null,null,null,null,null,null,null,null,null,null,null,null,null,null,null,null,null,null,null,null,null,null,null,null,null,null,null,null,null,null,null,null,null,null,null,null,null,null,null,null,null,null,null,null,null,null,null,null,null,null,null,null,null,null,null,null,null,null,null,null,null,null,null,null,null,null,-0.299999999999727,3984.13,15873291.8569,63241258285.831,null,251961394374328,1.00384695016859e+18]
[null,null,null,null,null,null,null,null,null,null,null,null,null,null,null,null,null,null,null,null,null,null,null,null,null,null,null,null,null,null,null,null,null,null,null,null,null,null,null,null,null,null,null,null,null,null,null,null,null,null,null,null,null,null,null,null,null,null,null,null,null,null,null,null,null,null,null,null,null,null,null,null,null,null,-0.670000000000073,4981.7,24817334.89,123632517221.513,null,615900111042411,3.06822958317998e+18]
[null,null,null,null,null,null,null,null,null,null,null,null,null,null,null,null,null,null,null,null,null,null,null,null,null,null,null,null,null,null,null,null,null,null,null,null,null,null,null,null,null,null,null,null,null,null,null,null,null,null,null,null,null,null,null,null,null,null,null,null,null,null,null,null,null,null,null,null,null,null,null,null,null,null,-1.0600000000004,5979.25,35751430.5625,213766741190.828,null,1278164787265260,7.6424668042558e+18]
[null,null,null,null,null,null,null,null,null,null,null,null,null,null,null,null,null,null,null,null,null,null,null,null,null,null,null,null,null,null,null,null,null,null,null,null,null,null,null,null,null,null,null,null,null,null,null,null,null,null,null,null,null,null,null,null,null,null,null,null,null,null,null,null,null,null,null,null,null,null,null,null,null,null,-1.69999999999982,6976.53,48671970.8409,339561464730.664,null,2368960745537420,1.65271257100642e+19]
[null,null,null,null,null,null,null,null,null,null,null,null,null,null,null,null,null,null,null,null,null,null,null,null,null,null,null,null,null,null,null,null,null,null,null,null,null,null,null,null,null,null,null,null,null,null,null,null,null,null,null,null,null,null,null,null,null,null,null,null,null,null,null,null,null,null,null,null,null,null,null,null,null,null,-1.94999999999982,8095.05,65529834.5025,530467286789.463,null,4294159209925040,3.47614335123037e+19]
[null,null,null,null,null,null,null,null,null,null,null,null,null,null,null,null,null,null,null,null,null,null,null,null,null,null,null,null,null,null,null,null,null,null,null,null,null,null,null,null,null,null,null,null,null,null,null,null,null,null,null,null,null,null,null,null,null,null,null,null,null,null,null,null,null,null,null,null,null,null,null,null,null,null,-2.54999999999927,9106.58,82929799.2964,755206851676.61,null,6877351611341180,6.26291526368074e+19]
[null,null,null,null,null,null,null,null,null,null,null,null,null,null,null,null,null,null,null,null,null,null,null,null,null,null,null,null,null,null,null,null,null,null,null,null,null,null,null,null,null,null,null,null,null,null,null,null,null,null,null,null,null,null,null,null,null,null,null,null,null,null,null,null,null,null,null,null,null,null,null,null,null,null,-2.78000000000065,9973.88,99478282.2544,992184449811.515,null,9895928640286070,9.87008047467764e+19]
[null,null,null,null,null,null,null,null,null,null,null,null,null,null,null,null,null,null,null,null,null,null,null,null,null,null,null,null,null,null,null,null,null,null,null,null,null,null,null,null,null,null,null,null,null,null,null,null,null,null,null,null,null,null,null,null,null,null,null,null,null,null,null,null,null,null,null,null,null,null,null,null,null,null,null,0.815137625858802,0.828729388343224,0.807327230870854,null,0.592102281664828,0.611336897060241]
[null,null,null,null,null,null,null,null,null,null,null,null,null,null,null,null,null,null,null,null,null,null,null,null,null,null,null,null,null,null,null,null,null,null,null,null,null,null,null,null,null,null,null,null,null,null,null,null,null,null,null,null,null,null,null,null,null,null,null,null,null,null,null,null,null,null,null,null,null,null,null,null,null,null,null,{"$f":"BX65/$BW$18","v":8.17044607973813e-5},{"$f":"BY65/$BW$18","v":8.30668167846979e-5},{"$f":"BZ65/$BW$18","v":8.09215940876861e-5},null,{"$f":"CB65/$BW$18","v":5.93487481446524e-5},{"$f":"CC65/$BW$18","v":6.12767095461047e-5}]
[]
[null,null,null,null,null,null,null,null,null,null,null,null,null,null,null,null,null,null,null,null,null,null,null,null,null,null,null,null,null,null,null,null,null,null,null,null,null,null,null,null,null,null,null,null,null,null,null,null,null,null,null,null,null,null,null,null,null,null,null,null,null,null,null,null,null,null,null,null,null,null,null,null,null,"Resumen"]
[]
[null,null,null,null,null,null,null,null,null,null,null,null,null,null,null,null,null,null,null,null,null,null,null,null,null,null,null,null,null,null,null,null,null,null,null,null,null,null,null,null,null,null,null,null,null,null,null,null,null,null,null,null,null,null,null,null,null,null,null,null,null,null,null,null,null,null,null,null,null,null,null,null,null,"Estadísticas de la regresión"]
[null,null,null,null,null,null,null,null,null,null,null,null,null,null,null,null,null,null,null,null,null,null,null,null,null,null,null,null,null,null,null,null,null,null,null,null,null,null,null,null,null,null,null,null,null,null,null,null,null,null,null,null,null,null,null,null,null,null,null,null,null,null,null,null,null,null,null,null,null,null,null,null,null,"Coeficiente de correlación múltiple",0.942356038303841]
[null,null,null,null,null,null,null,null,null,null,null,null,null,null,null,null,null,null,null,null,null,null,null,null,null,null,null,null,null,null,null,null,null,null,null,null,null,null,null,null,null,null,null,null,null,null,null,null,null,null,null,null,null,null,null,null,null,null,null,null,null,null,null,null,null,null,null,null,null,null,null,null,null,"Coeficiente de determinación R^2",0.88803490292771]
[null,null,null,null,null,null,null,null,null,null,null,null,null,null,null,null,null,null,null,null,null,null,null,null,null,null,null,null,null,null,null,null,null,null,null,null,null,null,null,null,null,null,null,null,null,null,null,null,null,null,null,null,null,null,null,null,null,null,null,null,null,null,null,null,null,null,null,null,null,null,null,null,null,"R^2  ajustado",0.798462825269878]
[null,null,null,null,null,null,null,null,null,null,null,null,null,null,null,null,null,null,null,null,null,null,null,null,null,null,null,null,null,null,null,null,null,null,null,null,null,null,null,null,null,null,null,null,null,null,null,null,null,null,null,null,null,null,null,null,null,null,null,null,null,null,null,null,null,null,null,null,null,null,null,null,null,"Error típico",0.592102281664828]
[null,null,null,null,null,null,null,null,null,null,null,null,null,null,null,null,null,null,null,null,null,null,null,null,null,null,null,null,null,null,null,null,null,null,null,null,null,null,null,null,null,null,null,null,null,null,null,null,null,null,null,null,null,null,null,null,null,null,null,null,null,null,null,null,null,null,null,null,null,null,null,null,null,"Observaciones",10]
[]
[null,null,null,null,null,null,null,null,null,null,null,null,null,null,null,null,null,null,null,null,null,null,null,null,null,null,null,null,null,null,null,null,null,null,null,null,null,null,null,null,null,null,null,null,null,null,null,null,null,null,null,null,null,null,null,null,null,null,null,null,null,null,null,null,null,null,null,null,null,null,null,null,null,"ANÁLISIS DE VARIANZA"]
[null,null,null,null,null,null,null,null,null,null,null,null,null,null,null,null,null,null,null,null,null,null,null,null,null,null,null,null,null,null,null,null,null,null,null,null,null,null,null,null,null,null,null,null,null,null,null,null,null,null,null,null,null,null,null,null,null,null,null,null,null,null,null,null,null,null,null,null,null,null,null,null,null,null,"Grados de libertad","Suma de cuadrados","Promedio de los cuadrados","F",null,"Valor crítico de F"]
[null,null,null,null,null,null,null,null,null,null,null,null,null,null,null,null,null,null,null,null,null,null,null,null,null,null,null,null,null,null,null,null,null,null,null,null,null,null,null,null,null,null,null,null,null,null,null,null,null,null,null,null,null,null,null,null,null,null,null,null,null,null,null,null,null,null,null,null,null,null,null,null,null,"Regresión",4,13.9030744402339,3.47576861005848,9.91419341996321,null,0.0135074787410595]
[null,null,null,null,null,null,null,null,null,null,null,null,null,null,null,null,null,null,null,null,null,null,null,null,null,null,null,null,null,null,null,null,null,null,null,null,null,null,null,null,null,null,null,null,null,null,null,null,null,null,null,null,null,null,null,null,null,null,null,null,null,null,null,null,null,null,null,null,null,null,null,null,null,"Residuos",5,1.75292555976348,0.350585111952695]
[null,null,null,null,null,null,null,null,null,null,null,null,null,null,null,null,null,null,null,null,null,null,null,null,null,null,null,null,null,null,null,null,null,null,null,null,null,null,null,null,null,null,null,null,null,null,null,null,null,null,null,null,null,null,null,null,null,null,null,null,null,null,null,null,null,null,null,null,null,null,null,null,null,"Total",9,15.6559999999974]
[]
[null,null,null,null,null,null,null,null,null,null,null,null,null,null,null,null,null,null,null,null,null,null,null,null,null,null,null,null,null,null,null,null,null,null,null,null,null,null,null,null,null,null,null,null,null,null,null,null,null,null,null,null,null,null,null,null,null,null,null,null,null,null,null,null,null,null,null,null,null,null,null,null,null,null,"Coeficientes","Error típico","Estadístico t","Probabilidad",null,"Inferior 95%","Superior 95%","Inferior 95,0%","Superior 95,0%","Superior 95,0%"]
[null,null,null,null,null,null,null,null,null,null,null,null,null,null,null,null,null,null,null,null,null,null,null,null,null,null,null,null,null,null,null,null,null,null,null,null,null,null,null,null,null,null,null,null,null,null,null,null,null,null,null,null,null,null,null,null,null,null,null,null,null,null,null,null,null,null,null,null,null,null,null,null,null,"Intercepción",4.08219964359683,1.95690016050957,2.08605412068331,0.0913565378635571,null,-0.948172363162865,9.11257165035653,-0.948172363162865,9.11257165035653,11.8271023233712]
[null,null,null,null,null,null,null,null,null,null,null,null,null,null,null,null,null,null,null,null,null,null,null,null,null,null,null,null,null,null,null,null,null,null,null,null,null,null,null,null,null,null,null,null,null,null,null,null,null,null,null,null,null,null,null,null,null,null,null,null,null,null,null,null,null,null,null,null,null,null,null,null,null,"Variable X 1",-0.00557005474844598,0.00217869935947606,-2.55659631248319,0.0508565151625599,null,-0.0111705797472276,3.04702503356466e-5,-0.0111705797472276,3.04702503356466e-5,0.0141361834970689]
[null,null,null,null,null,null,null,null,null,null,null,null,null,null,null,null,null,null,null,null,null,null,null,null,null,null,null,null,null,null,null,null,null,null,null,null,null,null,null,null,null,null,null,null,null,null,null,null,null,null,null,null,null,null,null,null,null,null,null,null,null,null,null,null,null,null,null,null,null,null,null,null,null,"Variable X 2",2.04231096541174e-6,7.45295484545709e-7,2.74027014487632,0.0407789610919837,null,1.26467930656775e-7,3.95815400016671e-6,1.26467930656775e-7,3.95815400016671e-6,7.48958451498085e-6]
[null,null,null,null,null,null,null,null,null,null,null,null,null,null,null,null,null,null,null,null,null,null,null,null,null,null,null,null,null,null,null,null,null,null,null,null,null,null,null,null,null,null,null,null,null,null,null,null,null,null,null,null,null,null,null,null,null,null,null,null,null,null,null,null,null,null,null,null,null,null,null,null,null,"Variable X 3",-2.59118393701997e-10,9.83653850974155e-11,-2.63424367673019,0.0462959586609791,null,-5.11974665888784e-10,-6.26212151520925e-12,-5.11974665888784e-10,-6.26212151520925e-12,1.87073603375534e-9]
[null,null,null,null,null,null,null,null,null,null,null,null,null,null,null,null,null,null,null,null,null,null,null,null,null,null,null,null,null,null,null,null,null,null,null,null,null,null,null,null,null,null,null,null,null,null,null,null,null,null,null,null,null,null,null,null,null,null,null,null,null,null,null,null,null,null,null,null,null,null,null,null,null,"Variable X 4",1.08958632654738e-14,4.39196656771076e-15,2.48086206884611,0.0557821085988581,null,-3.940462162054e-16,2.21857727471531e-14,-3.940462162054e-16,2.21857727471531e-14,1.22884161667992e-13]
[null,null,null,null,null,null,null,null,null,null,null,null,null,null,null,null,null,null,null,null,null,null,null,null,null,null,null,null,null,null,null,null,null,null,null,null,null,null,null,null,null,null,null,null,null,null,null,null,null,null,null,null,null,null,null,null,null,null,null,null,null,null,null,null,null,null,null,null,null,null,null,null,null,null,null,null,null,null,null,null,null,null,null,7.42469380610233e-18]

{"sheet":"CMC","index":8,"n_rows":7,"n_cols":2,"rows_kept":7,"cut":false,"hidden":true,"merged":[]}
["INTERVALO","CMC"]
["(-68,947 a 0 kPa)\n(-10 psi a 0 psi)","0,23 kPa\n0,034 (psi)"]
[">0 kPa a 344,738 kPa\n(>0 psi a 50 psi)","0,23 kPa\n0,033 (psi)"]
[">344,74 kPa a 2 068,43 kPa\n(>50 psi a 300 psi)","0,30 kPa\n0,44 (psi)"]
[">2 068,43 kPa a 20 684,27 kPa\n(>300 psi a 3 000 psi)","1,4 kPa\n0,21 (psi)"]
[">34 473,79 kPa a 68 947,57 kPa\n(>5 000 psi a 10 000 psi)","9,3 kPa\n1,4 (psi)"]
[">68 947,57 kPa a 248 211,26 kPa\n(>10 000 psi a 36 000 psi)","62 kPa\n8,9 (psi)"]

{"sheet":"LISTAS","index":9,"n_rows":37,"n_cols":16,"rows_kept":37,"cut":false,"hidden":false,"merged":[[22,0,22,3]]}
["ESPECIALISTA TÉCNICO","Nombre de firma"]
["ALEIDIMAR PIÑA","firma_juancarlos",1025]
["MICHAEL VALERO","firma_germica","Michael"]
[]
[]
[null,null,null,null,null,null,null,"FIRMA ACTUAL","CLAVE ACTUAL"]
["DIRECTOR TÉCNICO","Nombre de firma",null,null,null,null,"Especialista",{"$f":"VLOOKUP(REGISTRO!D161,LISTAS!A2:B4,2,0)","v":"firma_germica"},{"$f":"VLOOKUP(H7,B2:C4,2,0)","v":"Michael"}]
["JUAN CARLOS FANEITE FINOL","firma_juancarlos","DIRECTOR1",null,null,null,"Director",{"$f":"VLOOKUP(REGISTRO!D161,LISTAS!A8:B8,2,0)","v":{"$error":"#N/A"}},{"$f":"VLOOKUP(H8,B8:C11,2,0)","v":{"$error":"#N/A"}}]
[null,null,null,null,null,null,"ESPECIALISTA"]
[]
[]
[]
[]
[]
[]
["CALIBRACIÓN EN:"]
["INSTALACIONES PERMANENTES"]
["INSTALACIONES DEL CLIENTE "]
[]
[]
[]
[]
["CALIBRATION SERVICE S.A.S. a definido su regla de decisión usando  el documento ILAC-G8:09/2019 y se establece como Declaración binaria con banda de seguridad. El limite de aceptación se determinó usando la siguiente formula:\n\n                                                                             LA=√(EMP^2-U^2 )\nDonde \n\nLA: Límite de aceptación;                EMP: Error máximo permitido;                U: Incertidumbre expandida \n\nUn resultado es CONFORME cuando la corrección más (+) su  Incertidumbre  (±U) es menor o igual al error máximo permitido (EMP) y  la corrección (el error) es menor o igual al límite de aceptación (LA), en cualquier otro caso el resultado es NO CONFORME.\n"]
[]
[]
[]
[]
[]
[]
[]
[]
[]
[]
[]
[]
[]
[null,null,null,null,null,null,null,null,null,null,null,null,null,null,null,"LUIS JORDAN"]